BDBM50311295 CHEMBL1080223::N-(2-chlorophenyl)-4-methylpyrazolo[1,5-a]pyridine-3-carboxamide
SMILES: Cc1cccn2ncc(C(=O)Nc3ccccc3Cl)c12
InChI Key: InChIKey=KQPPEGZXTCVFKC-UHFFFAOYSA-N
Data: 1 IC50
Activity Spreadsheet -- Enzyme Inhibition Constant Data from BindingDB
Found 1 hit for monomerid = 50311295
Trg + Lig
Ki
nM
ΔG°
kcal/mole
IC50
nM
Kd
nM
EC50/IC50
nM
koff
s-1
kon
M-1s-1
pHTemp
°C
Ephrin type-B receptor 3
(Homo sapiens (Human))
BDBM50311295
(CHEMBL1080223 | N-(2-chlorophenyl)-4-methylpyrazol...)
Show SMILES Cc1cccn2ncc(C(=O)Nc3ccccc3Cl)c12
Show InChI InChI=1S/C15H12ClN3O/c1-10-5-4-8-19-14(10)11(9-17-19)15(20)18-13-7-3-2-6-12(13)16/h2-9H,1H3,(H,18,20)
Reactome pathway
n/an/a 1.50E+4n/an/an/an/an/an/a
Harvard Medical School
Curated by ChEMBL
Assay Description
Inhibition of human recombinant EphB3 kinase-mediated BTK-peptide phosphorylation assessed as 33P incorporation after 30 mins by scintillation counti...
Bioorg Med Chem Lett 19: 6122-6 (2009)
Article DOI: 10.1016/j.bmcl.2009.09.010
BindingDB Entry DOI: 10.7270/Q2T43T66