null
SMILES: Clc1ccccc1NC(=O)c1cnn2ccncc12
InChI Key: InChIKey=RDDQTDGRUCZTOW-UHFFFAOYSA-N
Activity Spreadsheet -- Enzyme Inhibition Constant Data from BindingDB
Found 1 hit for monomerid = 50311310
Trg + Lig
Ki
nM
ΔG°
kcal/mole
IC50
nM
Kd
nM
EC50/IC50
nM
koff
s-1
kon
M-1s-1
pHTemp
°C
Ephrin type-B receptor 3
(Homo sapiens (Human))
BDBM50311310
(CHEMBL1077850 | N-(2-chlorophenyl)pyrazolo[1,5-a]p...)
Show SMILES Clc1ccccc1NC(=O)c1cnn2ccncc12
Show InChI InChI=1S/C13H9ClN4O/c14-10-3-1-2-4-11(10)17-13(19)9-7-16-18-6-5-15-8-12(9)18/h1-8H,(H,17,19)
Reactome pathway
n/an/a 1.50E+4n/an/an/an/an/an/a
Harvard Medical School
Curated by ChEMBL
Assay Description
Inhibition of human recombinant EphB3 kinase-mediated BTK-peptide phosphorylation assessed as 33P incorporation after 30 mins by scintillation counti...
Bioorg Med Chem Lett 19: 6122-6 (2009)
Article DOI: 10.1016/j.bmcl.2009.09.010
BindingDB Entry DOI: 10.7270/Q2T43T66