BDBM50311335 2-(1-(4-chloro-3-ethoxybenzyl)piperidin-4-ylamino)benzo[d]oxazole-6-carboxylic acid::CHEMBL1080586
SMILES: CCOc1cc(CN2CCC(CC2)Nc2nc3ccc(cc3o2)C(O)=O)ccc1Cl
InChI Key: InChIKey=MUGBUVZHEILUBD-UHFFFAOYSA-N
Data: 5 KI  2 IC50
Activity Spreadsheet -- Enzyme Inhibition Constant Data from BindingDB
Found 7 hits for monomerid = 50311335
Trg + Lig
Ki
nM
ΔG°
kcal/mole
IC50
nM
Kd
nM
EC50/IC50
nM
koff
s-1
kon
M-1s-1
pHTemp
°C
Somatostatin receptor type 5
(Homo sapiens (Human))
BDBM50311335
(2-(1-(4-chloro-3-ethoxybenzyl)piperidin-4-ylamino)...)
Show SMILES CCOc1cc(CN2CCC(CC2)Nc2nc3ccc(cc3o2)C(O)=O)ccc1Cl
Show InChI InChI=1S/C22H24ClN3O4/c1-2-29-19-11-14(3-5-17(19)23)13-26-9-7-16(8-10-26)24-22-25-18-6-4-15(21(27)28)12-20(18)30-22/h3-6,11-12,16H,2,7-10,13H2,1H3,(H,24,25)(H,27,28)
Reactome pathway
23n/an/an/an/an/an/an/an/a
F. Hoffmann-La Roche Ltd
Curated by ChEMBL
Assay Description
Displacement of SST14 from human recombinant SST5 receptor expressed in CHO cells by radioligand binding assay
Bioorg Med Chem Lett 19: 6106-13 (2009)
Article DOI: 10.1016/j.bmcl.2009.09.024
BindingDB Entry DOI: 10.7270/Q2PC32H9
Somatostatin receptor type 3
(Homo sapiens (Human))
BDBM50311335
(2-(1-(4-chloro-3-ethoxybenzyl)piperidin-4-ylamino)...)
Show SMILES CCOc1cc(CN2CCC(CC2)Nc2nc3ccc(cc3o2)C(O)=O)ccc1Cl
Show InChI InChI=1S/C22H24ClN3O4/c1-2-29-19-11-14(3-5-17(19)23)13-26-9-7-16(8-10-26)24-22-25-18-6-4-15(21(27)28)12-20(18)30-22/h3-6,11-12,16H,2,7-10,13H2,1H3,(H,24,25)(H,27,28)
Reactome pathway
>1.00E+4n/an/an/an/an/an/an/an/a
F. Hoffmann-La Roche Ltd
Curated by ChEMBL
Assay Description
Displacement of SST14 from human recombinant SST3 receptor
Bioorg Med Chem Lett 19: 6106-13 (2009)
Article DOI: 10.1016/j.bmcl.2009.09.024
BindingDB Entry DOI: 10.7270/Q2PC32H9
Somatostatin receptor type 4
(Homo sapiens (Human))
BDBM50311335
(2-(1-(4-chloro-3-ethoxybenzyl)piperidin-4-ylamino)...)
Show SMILES CCOc1cc(CN2CCC(CC2)Nc2nc3ccc(cc3o2)C(O)=O)ccc1Cl
Show InChI InChI=1S/C22H24ClN3O4/c1-2-29-19-11-14(3-5-17(19)23)13-26-9-7-16(8-10-26)24-22-25-18-6-4-15(21(27)28)12-20(18)30-22/h3-6,11-12,16H,2,7-10,13H2,1H3,(H,24,25)(H,27,28)
>1.00E+4n/an/an/an/an/an/an/an/a
F. Hoffmann-La Roche Ltd
Curated by ChEMBL
Assay Description
Displacement of SST14 from human recombinant SST4 receptor
Bioorg Med Chem Lett 19: 6106-13 (2009)
Article DOI: 10.1016/j.bmcl.2009.09.024
BindingDB Entry DOI: 10.7270/Q2PC32H9
Somatostatin receptor type 2
(Homo sapiens (Human))
BDBM50311335
(2-(1-(4-chloro-3-ethoxybenzyl)piperidin-4-ylamino)...)
Show SMILES CCOc1cc(CN2CCC(CC2)Nc2nc3ccc(cc3o2)C(O)=O)ccc1Cl
Show InChI InChI=1S/C22H24ClN3O4/c1-2-29-19-11-14(3-5-17(19)23)13-26-9-7-16(8-10-26)24-22-25-18-6-4-15(21(27)28)12-20(18)30-22/h3-6,11-12,16H,2,7-10,13H2,1H3,(H,24,25)(H,27,28)
>1.00E+4n/an/an/an/an/an/an/an/a
F. Hoffmann-La Roche Ltd
Curated by ChEMBL
Assay Description
Displacement of SST14 from human recombinant SST2 receptor
Bioorg Med Chem Lett 19: 6106-13 (2009)
Article DOI: 10.1016/j.bmcl.2009.09.024
BindingDB Entry DOI: 10.7270/Q2PC32H9
Somatostatin receptor type 1
(Homo sapiens (Human))
BDBM50311335
(2-(1-(4-chloro-3-ethoxybenzyl)piperidin-4-ylamino)...)
Show SMILES CCOc1cc(CN2CCC(CC2)Nc2nc3ccc(cc3o2)C(O)=O)ccc1Cl
Show InChI InChI=1S/C22H24ClN3O4/c1-2-29-19-11-14(3-5-17(19)23)13-26-9-7-16(8-10-26)24-22-25-18-6-4-15(21(27)28)12-20(18)30-22/h3-6,11-12,16H,2,7-10,13H2,1H3,(H,24,25)(H,27,28)
>1.00E+4n/an/an/an/an/an/an/an/a
F. Hoffmann-La Roche Ltd
Curated by ChEMBL
Assay Description
Displacement of SST14 from human recombinant SST1 receptor
Bioorg Med Chem Lett 19: 6106-13 (2009)
Article DOI: 10.1016/j.bmcl.2009.09.024
BindingDB Entry DOI: 10.7270/Q2PC32H9
Somatostatin receptor type 5
(Homo sapiens (Human))
BDBM50311335
(2-(1-(4-chloro-3-ethoxybenzyl)piperidin-4-ylamino)...)
Show SMILES CCOc1cc(CN2CCC(CC2)Nc2nc3ccc(cc3o2)C(O)=O)ccc1Cl
Show InChI InChI=1S/C22H24ClN3O4/c1-2-29-19-11-14(3-5-17(19)23)13-26-9-7-16(8-10-26)24-22-25-18-6-4-15(21(27)28)12-20(18)30-22/h3-6,11-12,16H,2,7-10,13H2,1H3,(H,24,25)(H,27,28)
Reactome pathway
n/an/a 98n/an/an/an/an/an/a
F. Hoffmann-La Roche Ltd
Curated by ChEMBL
Assay Description
Antagonist activity at human SST5 receptor expressed in CHO cells assessed as inhibition of forskolin-induced cAMP release by TR-FRET assay
Bioorg Med Chem Lett 19: 6106-13 (2009)
Article DOI: 10.1016/j.bmcl.2009.09.024
BindingDB Entry DOI: 10.7270/Q2PC32H9
Potassium voltage-gated channel subfamily H member 2
(Homo sapiens (Human))
BDBM50311335
(2-(1-(4-chloro-3-ethoxybenzyl)piperidin-4-ylamino)...)
Show SMILES CCOc1cc(CN2CCC(CC2)Nc2nc3ccc(cc3o2)C(O)=O)ccc1Cl
Show InChI InChI=1S/C22H24ClN3O4/c1-2-29-19-11-14(3-5-17(19)23)13-26-9-7-16(8-10-26)24-22-25-18-6-4-15(21(27)28)12-20(18)30-22/h3-6,11-12,16H,2,7-10,13H2,1H3,(H,24,25)(H,27,28)
Reactome pathway
n/an/a>1.00E+4n/an/an/an/an/an/a
F. Hoffmann-La Roche Ltd
Curated by ChEMBL
Assay Description
Inhibition of human ERG expressed in CHO cells by patch clamp technique
Bioorg Med Chem Lett 19: 6106-13 (2009)
Article DOI: 10.1016/j.bmcl.2009.09.024
BindingDB Entry DOI: 10.7270/Q2PC32H9