BDBM50311410 CHEMBL1077376::N-((5S,8R,11R,14R,17R,20R,23R,33R)-1-amino-33-(4-aminobutyl)-5-carbamoyl-8,11,14,17,20,23-hexakis(3-guanidinopropyl)-7,10,13,16,19,22,25,32,35-nonaoxo-6,9,12,15,18,21,24,31,34-nonaazatetracontan-40-yl)-5-(2-aminopyrimidin-4-yl)thiophene-2-carboxamide
SMILES: [#7]-[#6]-[#6]-[#6]-[#6]-[#6@H](-[#7]-[#6](=O)-[#6@@H](-[#6]-[#6]-[#6]\[#7]=[#6](/[#7])-[#7])-[#7]-[#6](=O)-[#6@@H](-[#6]-[#6]-[#6]\[#7]=[#6](/[#7])-[#7])-[#7]-[#6](=O)-[#6@@H](-[#6]-[#6]-[#6]\[#7]=[#6](/[#7])-[#7])-[#7]-[#6](=O)-[#6@@H](-[#6]-[#6]-[#6]\[#7]=[#6](\[#7])-[#7])-[#7]-[#6](=O)-[#6@@H](-[#6]-[#6]-[#6]\[#7]=[#6](\[#7])-[#7])-[#7]-[#6](=O)-[#6@@H](-[#6]-[#6]-[#6]\[#7]=[#6](\[#7])-[#7])-[#7]-[#6](=O)-[#6]-[#6]-[#6]-[#6]-[#6]-[#7]-[#6](=O)-[#6@@H](-[#6]-[#6]-[#6]-[#6]-[#7])-[#7]-[#6](=O)-[#6]-[#6]-[#6]-[#6]-[#6]-[#7]-[#6](=O)-c1ccc(s1)-c1ccnc(-[#7])n1)-[#6](-[#7])=O
InChI Key: InChIKey=ZENNWRXLFOADLL-FKXYCMAXSA-N
Data: 2 IC50
Activity Spreadsheet -- Enzyme Inhibition Constant Data from BindingDB
Found 2 hits for monomerid = 50311410
Trg + Lig
Ki
nM
ΔG°
kcal/mole
IC50
nM
Kd
nM
EC50/IC50
nM
koff
s-1
kon
M-1s-1
pHTemp
°C
Serine/threonine-protein kinase AKT
(Homo sapiens (Human))
BDBM50311410
(CHEMBL1077376 | N-((5S,8R,11R,14R,17R,20R,23R,33R)...)
Show SMILES [#7]-[#6]-[#6]-[#6]-[#6]-[#6@H](-[#7]-[#6](=O)-[#6@@H](-[#6]-[#6]-[#6]\[#7]=[#6](/[#7])-[#7])-[#7]-[#6](=O)-[#6@@H](-[#6]-[#6]-[#6]\[#7]=[#6](/[#7])-[#7])-[#7]-[#6](=O)-[#6@@H](-[#6]-[#6]-[#6]\[#7]=[#6](/[#7])-[#7])-[#7]-[#6](=O)-[#6@@H](-[#6]-[#6]-[#6]\[#7]=[#6](\[#7])-[#7])-[#7]-[#6](=O)-[#6@@H](-[#6]-[#6]-[#6]\[#7]=[#6](\[#7])-[#7])-[#7]-[#6](=O)-[#6@@H](-[#6]-[#6]-[#6]\[#7]=[#6](\[#7])-[#7])-[#7]-[#6](=O)-[#6]-[#6]-[#6]-[#6]-[#6]-[#7]-[#6](=O)-[#6@@H](-[#6]-[#6]-[#6]-[#6]-[#7])-[#7]-[#6](=O)-[#6]-[#6]-[#6]-[#6]-[#6]-[#7]-[#6](=O)-c1ccc(s1)-c1ccnc(-[#7])n1)-[#6](-[#7])=O |r|
Show InChI InChI=1S/C69H126N34O11S/c70-30-7-5-17-42(54(72)106)97-57(109)45(20-12-35-89-64(75)76)99-59(111)47(22-14-37-91-66(79)80)101-61(113)49(24-16-39-93-68(83)84)102-60(112)48(23-15-38-92-67(81)82)100-58(110)46(21-13-36-90-65(77)78)98-56(108)44(19-11-34-88-63(73)74)96-53(105)26-3-1-9-32-86-55(107)43(18-6-8-31-71)95-52(104)25-4-2-10-33-87-62(114)51-28-27-50(115-51)41-29-40-94-69(85)103-41/h27-29,40,42-49H,1-26,30-39,70-71H2,(H2,72,106)(H,86,107)(H,87,114)(H,95,104)(H,96,105)(H,97,109)(H,98,108)(H,99,111)(H,100,110)(H,101,113)(H,102,112)(H4,73,74,88)(H4,75,76,89)(H4,77,78,90)(H4,79,80,91)(H4,81,82,92)(H4,83,84,93)(H2,85,94,103)/t42-,43+,44+,45+,46+,47+,48+,49+/m0/s1
NCI pathway
Reactome pathway
n/an/a 42n/an/an/an/an/an/a
University of Tartu
Curated by ChEMBL
Assay Description
Inhibition of PKBgamma in presence of 100 uM ATP
Bioorg Med Chem Lett 19: 6098-101 (2009)
Article DOI: 10.1016/j.bmcl.2009.09.026
BindingDB Entry DOI: 10.7270/Q2JM29R4
cAMP-dependent protein kinase (PKA)
(Homo sapiens (Human))
BDBM50311410
(CHEMBL1077376 | N-((5S,8R,11R,14R,17R,20R,23R,33R)...)
Show SMILES [#7]-[#6]-[#6]-[#6]-[#6]-[#6@H](-[#7]-[#6](=O)-[#6@@H](-[#6]-[#6]-[#6]\[#7]=[#6](/[#7])-[#7])-[#7]-[#6](=O)-[#6@@H](-[#6]-[#6]-[#6]\[#7]=[#6](/[#7])-[#7])-[#7]-[#6](=O)-[#6@@H](-[#6]-[#6]-[#6]\[#7]=[#6](/[#7])-[#7])-[#7]-[#6](=O)-[#6@@H](-[#6]-[#6]-[#6]\[#7]=[#6](\[#7])-[#7])-[#7]-[#6](=O)-[#6@@H](-[#6]-[#6]-[#6]\[#7]=[#6](\[#7])-[#7])-[#7]-[#6](=O)-[#6@@H](-[#6]-[#6]-[#6]\[#7]=[#6](\[#7])-[#7])-[#7]-[#6](=O)-[#6]-[#6]-[#6]-[#6]-[#6]-[#7]-[#6](=O)-[#6@@H](-[#6]-[#6]-[#6]-[#6]-[#7])-[#7]-[#6](=O)-[#6]-[#6]-[#6]-[#6]-[#6]-[#7]-[#6](=O)-c1ccc(s1)-c1ccnc(-[#7])n1)-[#6](-[#7])=O |r|
Show InChI InChI=1S/C69H126N34O11S/c70-30-7-5-17-42(54(72)106)97-57(109)45(20-12-35-89-64(75)76)99-59(111)47(22-14-37-91-66(79)80)101-61(113)49(24-16-39-93-68(83)84)102-60(112)48(23-15-38-92-67(81)82)100-58(110)46(21-13-36-90-65(77)78)98-56(108)44(19-11-34-88-63(73)74)96-53(105)26-3-1-9-32-86-55(107)43(18-6-8-31-71)95-52(104)25-4-2-10-33-87-62(114)51-28-27-50(115-51)41-29-40-94-69(85)103-41/h27-29,40,42-49H,1-26,30-39,70-71H2,(H2,72,106)(H,86,107)(H,87,114)(H,95,104)(H,96,105)(H,97,109)(H,98,108)(H,99,111)(H,100,110)(H,101,113)(H,102,112)(H4,73,74,88)(H4,75,76,89)(H4,77,78,90)(H4,79,80,91)(H4,81,82,92)(H4,83,84,93)(H2,85,94,103)/t42-,43+,44+,45+,46+,47+,48+,49+/m0/s1
NCI pathway
Reactome pathway
n/an/a 4.90n/an/an/an/an/an/a
University of Tartu
Curated by ChEMBL
Assay Description
Inhibition of PKACalpha in presence of 1000 uM ATP
Bioorg Med Chem Lett 19: 6098-101 (2009)
Article DOI: 10.1016/j.bmcl.2009.09.026
BindingDB Entry DOI: 10.7270/Q2JM29R4