null
SMILES: CNC(=O)CN1c2ccccc2N(C2CCN(CC2)C2CCC3CCCCC3C2)S1(=O)=O
InChI Key: InChIKey=VZLSLBVSXDAJEI-UHFFFAOYSA-N
Activity Spreadsheet -- Enzyme Inhibition Constant Data from BindingDB
Found 3 hits for monomerid = 50311477
Trg + Lig
Ki
nM
ΔG°
kcal/mole
IC50
nM
Kd
nM
EC50/IC50
nM
koff
s-1
kon
M-1s-1
pHTemp
°C
Nociceptin receptor
(Homo sapiens (Human))
BDBM50311477
(2-{3-[1-(Decahydro-naphthalen-2-yl)-piperidin-4-yl...)
Show SMILES CNC(=O)CN1c2ccccc2N(C2CCN(CC2)C2CCC3CCCCC3C2)S1(=O)=O
Show InChI InChI=1S/C24H36N4O3S/c1-25-24(29)17-27-22-8-4-5-9-23(22)28(32(27,30)31)20-12-14-26(15-13-20)21-11-10-18-6-2-3-7-19(18)16-21/h4-5,8-9,18-21H,2-3,6-7,10-17H2,1H3,(H,25,29)
Reactome pathway
7.10n/an/an/an/an/an/an/an/a
Schering-Plough Research Institute
Curated by ChEMBL
Assay Description
Displacement of [3H]nociceptin from human NOP receptor expressed in CHO cells
Bioorg Med Chem Lett 19: 6441-6 (2009)
Article DOI: 10.1016/j.bmcl.2009.09.028
BindingDB Entry DOI: 10.7270/Q21J99W7
Mu-type opioid receptor
(Homo sapiens (Human))
BDBM50311477
(2-{3-[1-(Decahydro-naphthalen-2-yl)-piperidin-4-yl...)
Show SMILES CNC(=O)CN1c2ccccc2N(C2CCN(CC2)C2CCC3CCCCC3C2)S1(=O)=O
Show InChI InChI=1S/C24H36N4O3S/c1-25-24(29)17-27-22-8-4-5-9-23(22)28(32(27,30)31)20-12-14-26(15-13-20)21-11-10-18-6-2-3-7-19(18)16-21/h4-5,8-9,18-21H,2-3,6-7,10-17H2,1H3,(H,25,29)
NCI pathway
Reactome pathway
268n/an/an/an/an/an/an/an/a
Schering-Plough Research Institute
Curated by ChEMBL
Assay Description
Displacement of [3H]diprenorphine from human MOP receptor expressed in CHOK1 cells
Bioorg Med Chem Lett 19: 6441-6 (2009)
Article DOI: 10.1016/j.bmcl.2009.09.028
BindingDB Entry DOI: 10.7270/Q21J99W7
Nociceptin receptor
(Homo sapiens (Human))
BDBM50311477
(2-{3-[1-(Decahydro-naphthalen-2-yl)-piperidin-4-yl...)
Show SMILES CNC(=O)CN1c2ccccc2N(C2CCN(CC2)C2CCC3CCCCC3C2)S1(=O)=O
Show InChI InChI=1S/C24H36N4O3S/c1-25-24(29)17-27-22-8-4-5-9-23(22)28(32(27,30)31)20-12-14-26(15-13-20)21-11-10-18-6-2-3-7-19(18)16-21/h4-5,8-9,18-21H,2-3,6-7,10-17H2,1H3,(H,25,29)
Reactome pathway
n/an/a 12n/an/an/an/an/an/a
Schering-Plough Research Institute
Curated by ChEMBL
Assay Description
Agonist activity at human NOP receptor expressed in CHO cells assessed as inhibition of forskolin-stimulated cAMP production after 2 hrs
Bioorg Med Chem Lett 19: 6441-6 (2009)
Article DOI: 10.1016/j.bmcl.2009.09.028
BindingDB Entry DOI: 10.7270/Q21J99W7