null
SMILES: O=c1[nH]c2cnc(nc2n1C1CCOCC1)-n1cnc2ccc(cc12)C#N
InChI Key: InChIKey=XNHDUPKWQUTNRA-UHFFFAOYSA-N
Activity Spreadsheet -- Enzyme Inhibition Constant Data from BindingDB
Found 2 hits for monomerid = 50311640
Trg + Lig
Ki
nM
ΔG°
kcal/mole
IC50
nM
Kd
nM
EC50/IC50
nM
koff
s-1
kon
M-1s-1
pHTemp
°C
Tyrosine-protein kinase JAK2
(Homo sapiens (Human))
BDBM50311640
(1-(8-oxo-9-(tetrahydro-2H-pyran-4-yl)-8,9-dihydro-...)
Show SMILES O=c1[nH]c2cnc(nc2n1C1CCOCC1)-n1cnc2ccc(cc12)C#N
Show InChI InChI=1S/C18H15N7O2/c19-8-11-1-2-13-15(7-11)24(10-21-13)17-20-9-14-16(23-17)25(18(26)22-14)12-3-5-27-6-4-12/h1-2,7,9-10,12H,3-6H2,(H,22,26)
Reactome pathway
n/an/a 470n/an/an/an/an/an/a
Ligand Pharmaceuticals, Inc
Curated by ChEMBL
Assay Description
Inhibition of human JAK2 (532-1132) by time resolved fluorescence assay
Bioorg Med Chem Lett 19: 6788-92 (2009)
Article DOI: 10.1016/j.bmcl.2009.09.080
BindingDB Entry DOI: 10.7270/Q24B31G4
Tyrosine-protein kinase JAK3
(Homo sapiens (Human))
BDBM50311640
(1-(8-oxo-9-(tetrahydro-2H-pyran-4-yl)-8,9-dihydro-...)
Show SMILES O=c1[nH]c2cnc(nc2n1C1CCOCC1)-n1cnc2ccc(cc12)C#N
Show InChI InChI=1S/C18H15N7O2/c19-8-11-1-2-13-15(7-11)24(10-21-13)17-20-9-14-16(23-17)25(18(26)22-14)12-3-5-27-6-4-12/h1-2,7,9-10,12H,3-6H2,(H,22,26)
Reactome pathway
n/an/a 7n/an/an/an/an/an/a
Ligand Pharmaceuticals, Inc
Curated by ChEMBL
Assay Description
Inhibition of human JAK3 (508-1124) by time resolved fluorescence assay
Bioorg Med Chem Lett 19: 6788-92 (2009)
Article DOI: 10.1016/j.bmcl.2009.09.080
BindingDB Entry DOI: 10.7270/Q24B31G4