BDBM50311786 Amperozide::CHEMBL1079935
SMILES: CCNC(=O)N1CCN(CCCC(c2ccc(F)cc2)c2ccc(F)cc2)CC1
InChI Key: InChIKey=NNAIYOXJNVGUOM-UHFFFAOYSA-N
Data: 18 KI  2 IC50
Activity Spreadsheet -- Enzyme Inhibition Constant Data from BindingDB
Found 20 hits for monomerid = 50311786
Trg + Lig
Ki
nM
ΔG°
kcal/mole
IC50
nM
Kd
nM
EC50/IC50
nM
koff
s-1
kon
M-1s-1
pHTemp
°C
5-hydroxytryptamine receptor 2A
(Rattus norvegicus (rat))
BDBM50311786
(Amperozide | CHEMBL1079935)
Show SMILES CCNC(=O)N1CCN(CCCC(c2ccc(F)cc2)c2ccc(F)cc2)CC1
Show InChI InChI=1S/C23H29F2N3O/c1-2-26-23(29)28-16-14-27(15-17-28)13-3-4-22(18-5-9-20(24)10-6-18)19-7-11-21(25)12-8-19/h5-12,22H,2-4,13-17H2,1H3,(H,26,29)
Reactome pathway
12.6n/an/an/an/an/an/an/an/a
Case Western Reserve University
Curated by PDSP Ki Database
J Pharmacol Exp Ther 268: 1403-10 (1994)
BindingDB Entry DOI: 10.7270/Q2154FJQ
5-hydroxytryptamine receptor 2A
(Rattus norvegicus (rat))
BDBM50311786
(Amperozide | CHEMBL1079935)
Show SMILES CCNC(=O)N1CCN(CCCC(c2ccc(F)cc2)c2ccc(F)cc2)CC1
Show InChI InChI=1S/C23H29F2N3O/c1-2-26-23(29)28-16-14-27(15-17-28)13-3-4-22(18-5-9-20(24)10-6-18)19-7-11-21(25)12-8-19/h5-12,22H,2-4,13-17H2,1H3,(H,26,29)
Reactome pathway
20n/an/an/an/an/an/an/an/a
H. Lundbeck A/S
Curated by PDSP Ki Database
Neuropsychopharmacology 18: 63-101 (1998)
Article DOI: 10.1016/S0893-133X(97)00112-7
BindingDB Entry DOI: 10.7270/Q2SF2TQB
HTR6
(RAT)
BDBM50311786
(Amperozide | CHEMBL1079935)
Show SMILES CCNC(=O)N1CCN(CCCC(c2ccc(F)cc2)c2ccc(F)cc2)CC1
Show InChI InChI=1S/C23H29F2N3O/c1-2-26-23(29)28-16-14-27(15-17-28)13-3-4-22(18-5-9-20(24)10-6-18)19-7-11-21(25)12-8-19/h5-12,22H,2-4,13-17H2,1H3,(H,26,29)
Reactome pathway
67n/an/an/an/an/an/an/an/a
Case Western Reserve University
Curated by PDSP Ki Database
J Pharmacol Exp Ther 268: 1403-10 (1994)
BindingDB Entry DOI: 10.7270/Q2154FJQ
HTR6
(RAT)
BDBM50311786
(Amperozide | CHEMBL1079935)
Show SMILES CCNC(=O)N1CCN(CCCC(c2ccc(F)cc2)c2ccc(F)cc2)CC1
Show InChI InChI=1S/C23H29F2N3O/c1-2-26-23(29)28-16-14-27(15-17-28)13-3-4-22(18-5-9-20(24)10-6-18)19-7-11-21(25)12-8-19/h5-12,22H,2-4,13-17H2,1H3,(H,26,29)
Reactome pathway
67n/an/an/an/an/an/an/an/a
H. Lundbeck A/S
Curated by PDSP Ki Database
Neuropsychopharmacology 18: 63-101 (1998)
Article DOI: 10.1016/S0893-133X(97)00112-7
BindingDB Entry DOI: 10.7270/Q2SF2TQB
Alpha-1A adrenergic receptor
(Rattus norvegicus (Rat))
BDBM50311786
(Amperozide | CHEMBL1079935)
Show SMILES CCNC(=O)N1CCN(CCCC(c2ccc(F)cc2)c2ccc(F)cc2)CC1
Show InChI InChI=1S/C23H29F2N3O/c1-2-26-23(29)28-16-14-27(15-17-28)13-3-4-22(18-5-9-20(24)10-6-18)19-7-11-21(25)12-8-19/h5-12,22H,2-4,13-17H2,1H3,(H,26,29)
130n/an/an/an/an/an/an/an/a
H. Lundbeck A/S
Curated by PDSP Ki Database
Neuropsychopharmacology 18: 63-101 (1998)
Article DOI: 10.1016/S0893-133X(97)00112-7
BindingDB Entry DOI: 10.7270/Q2SF2TQB
D(2) dopamine receptor
(Rattus norvegicus (rat))
BDBM50311786
(Amperozide | CHEMBL1079935)
Show SMILES CCNC(=O)N1CCN(CCCC(c2ccc(F)cc2)c2ccc(F)cc2)CC1
Show InChI InChI=1S/C23H29F2N3O/c1-2-26-23(29)28-16-14-27(15-17-28)13-3-4-22(18-5-9-20(24)10-6-18)19-7-11-21(25)12-8-19/h5-12,22H,2-4,13-17H2,1H3,(H,26,29)
Reactome pathway
140n/an/an/an/an/an/an/an/a
H. Lundbeck A/S
Curated by PDSP Ki Database
Neuropsychopharmacology 18: 63-101 (1998)
Article DOI: 10.1016/S0893-133X(97)00112-7
BindingDB Entry DOI: 10.7270/Q2SF2TQB
D(1A) dopamine receptor
(RAT)
BDBM50311786
(Amperozide | CHEMBL1079935)
Show SMILES CCNC(=O)N1CCN(CCCC(c2ccc(F)cc2)c2ccc(F)cc2)CC1
Show InChI InChI=1S/C23H29F2N3O/c1-2-26-23(29)28-16-14-27(15-17-28)13-3-4-22(18-5-9-20(24)10-6-18)19-7-11-21(25)12-8-19/h5-12,22H,2-4,13-17H2,1H3,(H,26,29)
260n/an/an/an/an/an/an/an/a
H. Lundbeck A/S
Curated by PDSP Ki Database
Neuropsychopharmacology 18: 63-101 (1998)
Article DOI: 10.1016/S0893-133X(97)00112-7
BindingDB Entry DOI: 10.7270/Q2SF2TQB
Serotonin receptor 2a and 2c (5HT2A and 5HT2C)
(Rattus norvegicus (Rat))
BDBM50311786
(Amperozide | CHEMBL1079935)
Show SMILES CCNC(=O)N1CCN(CCCC(c2ccc(F)cc2)c2ccc(F)cc2)CC1
Show InChI InChI=1S/C23H29F2N3O/c1-2-26-23(29)28-16-14-27(15-17-28)13-3-4-22(18-5-9-20(24)10-6-18)19-7-11-21(25)12-8-19/h5-12,22H,2-4,13-17H2,1H3,(H,26,29)
440n/an/an/an/an/an/an/an/a
H. Lundbeck A/S
Curated by PDSP Ki Database
Neuropsychopharmacology 18: 63-101 (1998)
Article DOI: 10.1016/S0893-133X(97)00112-7
BindingDB Entry DOI: 10.7270/Q2SF2TQB
D(2) dopamine receptor
(Rattus norvegicus (rat))
BDBM50311786
(Amperozide | CHEMBL1079935)
Show SMILES CCNC(=O)N1CCN(CCCC(c2ccc(F)cc2)c2ccc(F)cc2)CC1
Show InChI InChI=1S/C23H29F2N3O/c1-2-26-23(29)28-16-14-27(15-17-28)13-3-4-22(18-5-9-20(24)10-6-18)19-7-11-21(25)12-8-19/h5-12,22H,2-4,13-17H2,1H3,(H,26,29)
Reactome pathway
501n/an/an/an/an/an/an/an/a
Case Western Reserve University
Curated by PDSP Ki Database
J Pharmacol Exp Ther 268: 1403-10 (1994)
BindingDB Entry DOI: 10.7270/Q2154FJQ
Serotonin (5-HT) receptor
(Rattus norvegicus (rat))
BDBM50311786
(Amperozide | CHEMBL1079935)
Show SMILES CCNC(=O)N1CCN(CCCC(c2ccc(F)cc2)c2ccc(F)cc2)CC1
Show InChI InChI=1S/C23H29F2N3O/c1-2-26-23(29)28-16-14-27(15-17-28)13-3-4-22(18-5-9-20(24)10-6-18)19-7-11-21(25)12-8-19/h5-12,22H,2-4,13-17H2,1H3,(H,26,29)
Reactome pathway
549n/an/an/an/an/an/an/an/a
Case Western Reserve University
Curated by PDSP Ki Database
J Pharmacol Exp Ther 268: 1403-10 (1994)
BindingDB Entry DOI: 10.7270/Q2154FJQ
Serotonin (5-HT) receptor
(Rattus norvegicus (rat))
BDBM50311786
(Amperozide | CHEMBL1079935)
Show SMILES CCNC(=O)N1CCN(CCCC(c2ccc(F)cc2)c2ccc(F)cc2)CC1
Show InChI InChI=1S/C23H29F2N3O/c1-2-26-23(29)28-16-14-27(15-17-28)13-3-4-22(18-5-9-20(24)10-6-18)19-7-11-21(25)12-8-19/h5-12,22H,2-4,13-17H2,1H3,(H,26,29)
Reactome pathway
550n/an/an/an/an/an/an/an/a
H. Lundbeck A/S
Curated by PDSP Ki Database
Neuropsychopharmacology 18: 63-101 (1998)
Article DOI: 10.1016/S0893-133X(97)00112-7
BindingDB Entry DOI: 10.7270/Q2SF2TQB
adrenergic Alpha2
(RAT)
BDBM50311786
(Amperozide | CHEMBL1079935)
Show SMILES CCNC(=O)N1CCN(CCCC(c2ccc(F)cc2)c2ccc(F)cc2)CC1
Show InChI InChI=1S/C23H29F2N3O/c1-2-26-23(29)28-16-14-27(15-17-28)13-3-4-22(18-5-9-20(24)10-6-18)19-7-11-21(25)12-8-19/h5-12,22H,2-4,13-17H2,1H3,(H,26,29)
Reactome pathway
590n/an/an/an/an/an/an/an/a
H. Lundbeck A/S
Curated by PDSP Ki Database
Neuropsychopharmacology 18: 63-101 (1998)
Article DOI: 10.1016/S0893-133X(97)00112-7
BindingDB Entry DOI: 10.7270/Q2SF2TQB
Histamine H1 receptor
(RAT)
BDBM50311786
(Amperozide | CHEMBL1079935)
Show SMILES CCNC(=O)N1CCN(CCCC(c2ccc(F)cc2)c2ccc(F)cc2)CC1
Show InChI InChI=1S/C23H29F2N3O/c1-2-26-23(29)28-16-14-27(15-17-28)13-3-4-22(18-5-9-20(24)10-6-18)19-7-11-21(25)12-8-19/h5-12,22H,2-4,13-17H2,1H3,(H,26,29)
730n/an/an/an/an/an/an/an/a
H. Lundbeck A/S
Curated by PDSP Ki Database
Neuropsychopharmacology 18: 63-101 (1998)
Article DOI: 10.1016/S0893-133X(97)00112-7
BindingDB Entry DOI: 10.7270/Q2SF2TQB
Serotonin receptor 2a and 2c (5HT2A and 5HT2C)
(Rattus norvegicus (Rat))
BDBM50311786
(Amperozide | CHEMBL1079935)
Show SMILES CCNC(=O)N1CCN(CCCC(c2ccc(F)cc2)c2ccc(F)cc2)CC1
Show InChI InChI=1S/C23H29F2N3O/c1-2-26-23(29)28-16-14-27(15-17-28)13-3-4-22(18-5-9-20(24)10-6-18)19-7-11-21(25)12-8-19/h5-12,22H,2-4,13-17H2,1H3,(H,26,29)
1.15E+3n/an/an/an/an/an/an/an/a
Stanford University
Curated by PDSP Ki Database
J Pharmacol Exp Ther 260: 1361-5 (1992)
BindingDB Entry DOI: 10.7270/Q2513WPC
Serotonin receptor 2a and 2c (5HT2A and 5HT2C)
(Rattus norvegicus (Rat))
BDBM50311786
(Amperozide | CHEMBL1079935)
Show SMILES CCNC(=O)N1CCN(CCCC(c2ccc(F)cc2)c2ccc(F)cc2)CC1
Show InChI InChI=1S/C23H29F2N3O/c1-2-26-23(29)28-16-14-27(15-17-28)13-3-4-22(18-5-9-20(24)10-6-18)19-7-11-21(25)12-8-19/h5-12,22H,2-4,13-17H2,1H3,(H,26,29)
1.26E+3n/an/an/an/an/an/an/an/a
Case Western Reserve University
Curated by PDSP Ki Database
J Pharmacol Exp Ther 268: 1403-10 (1994)
BindingDB Entry DOI: 10.7270/Q2154FJQ
5-hydroxytryptamine receptor 6
(Homo sapiens (Human))
BDBM50311786
(Amperozide | CHEMBL1079935)
Show SMILES CCNC(=O)N1CCN(CCCC(c2ccc(F)cc2)c2ccc(F)cc2)CC1
Show InChI InChI=1S/C23H29F2N3O/c1-2-26-23(29)28-16-14-27(15-17-28)13-3-4-22(18-5-9-20(24)10-6-18)19-7-11-21(25)12-8-19/h5-12,22H,2-4,13-17H2,1H3,(H,26,29)
Reactome pathway
1.60E+3n/an/an/an/an/an/an/an/a
University of Washington
Curated by PDSP Ki Database
J Neurochem 66: 47-56 (1996)
Article DOI: 10.1046/j.1471-4159.1996.66010047.x
BindingDB Entry DOI: 10.7270/Q20K2721
5-hydroxytryptamine receptor 6
(Homo sapiens (Human))
BDBM50311786
(Amperozide | CHEMBL1079935)
Show SMILES CCNC(=O)N1CCN(CCCC(c2ccc(F)cc2)c2ccc(F)cc2)CC1
Show InChI InChI=1S/C23H29F2N3O/c1-2-26-23(29)28-16-14-27(15-17-28)13-3-4-22(18-5-9-20(24)10-6-18)19-7-11-21(25)12-8-19/h5-12,22H,2-4,13-17H2,1H3,(H,26,29)
Reactome pathway
1.60E+3n/an/an/an/an/an/an/an/a
H. Lundbeck A/S
Curated by PDSP Ki Database
Neuropsychopharmacology 18: 63-101 (1998)
Article DOI: 10.1016/S0893-133X(97)00112-7
BindingDB Entry DOI: 10.7270/Q2SF2TQB
Muscarinic acetylcholine receptor M2
(RAT)
BDBM50311786
(Amperozide | CHEMBL1079935)
Show SMILES CCNC(=O)N1CCN(CCCC(c2ccc(F)cc2)c2ccc(F)cc2)CC1
Show InChI InChI=1S/C23H29F2N3O/c1-2-26-23(29)28-16-14-27(15-17-28)13-3-4-22(18-5-9-20(24)10-6-18)19-7-11-21(25)12-8-19/h5-12,22H,2-4,13-17H2,1H3,(H,26,29)
Reactome pathway
1.70E+3n/an/an/an/an/an/an/an/a
H. Lundbeck A/S
Curated by PDSP Ki Database
Neuropsychopharmacology 18: 63-101 (1998)
Article DOI: 10.1016/S0893-133X(97)00112-7
BindingDB Entry DOI: 10.7270/Q2SF2TQB
Fatty-acid amide hydrolase 1
(Homo sapiens (Human))
BDBM50311786
(Amperozide | CHEMBL1079935)
Show SMILES CCNC(=O)N1CCN(CCCC(c2ccc(F)cc2)c2ccc(F)cc2)CC1
Show InChI InChI=1S/C23H29F2N3O/c1-2-26-23(29)28-16-14-27(15-17-28)13-3-4-22(18-5-9-20(24)10-6-18)19-7-11-21(25)12-8-19/h5-12,22H,2-4,13-17H2,1H3,(H,26,29)
n/an/a 455n/an/an/an/an/an/a
Renovis, Inc
Curated by ChEMBL
Assay Description
Inhibition of human FAAH-mediated hydrolysis of [3H]AEA
Bioorg Med Chem Lett 19: 6793-6 (2009)
Article DOI: 10.1016/j.bmcl.2009.09.086
BindingDB Entry DOI: 10.7270/Q2BV7GRN
Fatty-acid amide hydrolase 1
(Homo sapiens (Human))
BDBM50311786
(Amperozide | CHEMBL1079935)
Show SMILES CCNC(=O)N1CCN(CCCC(c2ccc(F)cc2)c2ccc(F)cc2)CC1
Show InChI InChI=1S/C23H29F2N3O/c1-2-26-23(29)28-16-14-27(15-17-28)13-3-4-22(18-5-9-20(24)10-6-18)19-7-11-21(25)12-8-19/h5-12,22H,2-4,13-17H2,1H3,(H,26,29)
n/an/a 1.34E+3n/an/an/an/an/an/a
Renovis, Inc
Curated by ChEMBL
Assay Description
Inhibition of human FAAH
Bioorg Med Chem Lett 19: 6793-6 (2009)
Article DOI: 10.1016/j.bmcl.2009.09.086
BindingDB Entry DOI: 10.7270/Q2BV7GRN