BDBM50311893 CHEMBL1076478::N-(4-methyl-3-(1-(6-(3-(4-methylpiperazin-1-yl)propylamino)pyrimidin-4-yl)-1H-benzo[d]imidazol-2-ylamino)phenyl)-3-(trifluoromethyl)benzamide
SMILES: CN1CCN(CCCNc2cc(ncn2)-n2c(Nc3cc(NC(=O)c4cccc(c4)C(F)(F)F)ccc3C)nc3ccccc23)CC1
InChI Key: InChIKey=FILQIUCXPQZUON-UHFFFAOYSA-N
Data: 8 IC50
Activity Spreadsheet -- Enzyme Inhibition Constant Data from BindingDB
Found 8 hits for monomerid = 50311893
Trg + Lig
Ki
nM
ΔG°
kcal/mole
IC50
nM
Kd
nM
EC50/IC50
nM
koff
s-1
kon
M-1s-1
pHTemp
°C
Tyrosine-protein kinase Lck
(Homo sapiens (Human))
BDBM50311893
(CHEMBL1076478 | N-(4-methyl-3-(1-(6-(3-(4-methylpi...)
Show SMILES CN1CCN(CCCNc2cc(ncn2)-n2c(Nc3cc(NC(=O)c4cccc(c4)C(F)(F)F)ccc3C)nc3ccccc23)CC1
Show InChI InChI=1S/C34H36F3N9O/c1-23-11-12-26(41-32(47)24-7-5-8-25(19-24)34(35,36)37)20-28(23)43-33-42-27-9-3-4-10-29(27)46(33)31-21-30(39-22-40-31)38-13-6-14-45-17-15-44(2)16-18-45/h3-5,7-12,19-22H,6,13-18H2,1-2H3,(H,41,47)(H,42,43)(H,38,39,40)
n/an/a 6n/an/an/an/an/an/a
Genomics Institute of the Novartis Research Foundation (GNF)
Curated by ChEMBL
Assay Description
Inhibition of LCK
Bioorg Med Chem Lett 19: 6691-5 (2009)
Article DOI: 10.1016/j.bmcl.2009.09.123
BindingDB Entry DOI: 10.7270/Q2Q52PRR
Proto-oncogene tyrosine-protein kinase Src
(Homo sapiens (Human))
BDBM50311893
(CHEMBL1076478 | N-(4-methyl-3-(1-(6-(3-(4-methylpi...)
Show SMILES CN1CCN(CCCNc2cc(ncn2)-n2c(Nc3cc(NC(=O)c4cccc(c4)C(F)(F)F)ccc3C)nc3ccccc23)CC1
Show InChI InChI=1S/C34H36F3N9O/c1-23-11-12-26(41-32(47)24-7-5-8-25(19-24)34(35,36)37)20-28(23)43-33-42-27-9-3-4-10-29(27)46(33)31-21-30(39-22-40-31)38-13-6-14-45-17-15-44(2)16-18-45/h3-5,7-12,19-22H,6,13-18H2,1-2H3,(H,41,47)(H,42,43)(H,38,39,40)
n/an/a 601n/an/an/an/an/an/a
Genomics Institute of the Novartis Research Foundation (GNF)
Curated by ChEMBL
Assay Description
Inhibition of Tel-fused SRC expressed in mouse BAF3 cells
Bioorg Med Chem Lett 19: 6691-5 (2009)
Article DOI: 10.1016/j.bmcl.2009.09.123
BindingDB Entry DOI: 10.7270/Q2Q52PRR
Insulin receptor
(Homo sapiens (Human))
BDBM50311893
(CHEMBL1076478 | N-(4-methyl-3-(1-(6-(3-(4-methylpi...)
Show SMILES CN1CCN(CCCNc2cc(ncn2)-n2c(Nc3cc(NC(=O)c4cccc(c4)C(F)(F)F)ccc3C)nc3ccccc23)CC1
Show InChI InChI=1S/C34H36F3N9O/c1-23-11-12-26(41-32(47)24-7-5-8-25(19-24)34(35,36)37)20-28(23)43-33-42-27-9-3-4-10-29(27)46(33)31-21-30(39-22-40-31)38-13-6-14-45-17-15-44(2)16-18-45/h3-5,7-12,19-22H,6,13-18H2,1-2H3,(H,41,47)(H,42,43)(H,38,39,40)
n/an/a 3.16E+3n/an/an/an/an/an/a
Genomics Institute of the Novartis Research Foundation (GNF)
Curated by ChEMBL
Assay Description
Inhibition of Tel-fused InsR expressed in mouse BAF3 cells
Bioorg Med Chem Lett 19: 6691-5 (2009)
Article DOI: 10.1016/j.bmcl.2009.09.123
BindingDB Entry DOI: 10.7270/Q2Q52PRR
Vascular endothelial growth factor receptor 2
(Homo sapiens (Human))
BDBM50311893
(CHEMBL1076478 | N-(4-methyl-3-(1-(6-(3-(4-methylpi...)
Show SMILES CN1CCN(CCCNc2cc(ncn2)-n2c(Nc3cc(NC(=O)c4cccc(c4)C(F)(F)F)ccc3C)nc3ccccc23)CC1
Show InChI InChI=1S/C34H36F3N9O/c1-23-11-12-26(41-32(47)24-7-5-8-25(19-24)34(35,36)37)20-28(23)43-33-42-27-9-3-4-10-29(27)46(33)31-21-30(39-22-40-31)38-13-6-14-45-17-15-44(2)16-18-45/h3-5,7-12,19-22H,6,13-18H2,1-2H3,(H,41,47)(H,42,43)(H,38,39,40)
NCI pathway
Reactome pathway
n/an/a 582n/an/an/an/an/an/a
Genomics Institute of the Novartis Research Foundation (GNF)
Curated by ChEMBL
Assay Description
Inhibition of Tel-fused KDR expressed in mouse BAF3 cells
Bioorg Med Chem Lett 19: 6691-5 (2009)
Article DOI: 10.1016/j.bmcl.2009.09.123
BindingDB Entry DOI: 10.7270/Q2Q52PRR
Proto-oncogene tyrosine-protein kinase Src
(Homo sapiens (Human))
BDBM50311893
(CHEMBL1076478 | N-(4-methyl-3-(1-(6-(3-(4-methylpi...)
Show SMILES CN1CCN(CCCNc2cc(ncn2)-n2c(Nc3cc(NC(=O)c4cccc(c4)C(F)(F)F)ccc3C)nc3ccccc23)CC1
Show InChI InChI=1S/C34H36F3N9O/c1-23-11-12-26(41-32(47)24-7-5-8-25(19-24)34(35,36)37)20-28(23)43-33-42-27-9-3-4-10-29(27)46(33)31-21-30(39-22-40-31)38-13-6-14-45-17-15-44(2)16-18-45/h3-5,7-12,19-22H,6,13-18H2,1-2H3,(H,41,47)(H,42,43)(H,38,39,40)
n/an/a 128n/an/an/an/an/an/a
Genomics Institute of the Novartis Research Foundation (GNF)
Curated by ChEMBL
Assay Description
Inhibition of SRC
Bioorg Med Chem Lett 19: 6691-5 (2009)
Article DOI: 10.1016/j.bmcl.2009.09.123
BindingDB Entry DOI: 10.7270/Q2Q52PRR
Tyrosine-protein kinase Lck
(Homo sapiens (Human))
BDBM50311893
(CHEMBL1076478 | N-(4-methyl-3-(1-(6-(3-(4-methylpi...)
Show SMILES CN1CCN(CCCNc2cc(ncn2)-n2c(Nc3cc(NC(=O)c4cccc(c4)C(F)(F)F)ccc3C)nc3ccccc23)CC1
Show InChI InChI=1S/C34H36F3N9O/c1-23-11-12-26(41-32(47)24-7-5-8-25(19-24)34(35,36)37)20-28(23)43-33-42-27-9-3-4-10-29(27)46(33)31-21-30(39-22-40-31)38-13-6-14-45-17-15-44(2)16-18-45/h3-5,7-12,19-22H,6,13-18H2,1-2H3,(H,41,47)(H,42,43)(H,38,39,40)
n/an/a 25n/an/an/an/an/an/a
Genomics Institute of the Novartis Research Foundation (GNF)
Curated by ChEMBL
Assay Description
Inhibition of Tel-fused LCK expressed in mouse BAF3 cells
Bioorg Med Chem Lett 19: 6691-5 (2009)
Article DOI: 10.1016/j.bmcl.2009.09.123
BindingDB Entry DOI: 10.7270/Q2Q52PRR
Tyrosine-protein kinase Lyn
(Homo sapiens (Human))
BDBM50311893
(CHEMBL1076478 | N-(4-methyl-3-(1-(6-(3-(4-methylpi...)
Show SMILES CN1CCN(CCCNc2cc(ncn2)-n2c(Nc3cc(NC(=O)c4cccc(c4)C(F)(F)F)ccc3C)nc3ccccc23)CC1
Show InChI InChI=1S/C34H36F3N9O/c1-23-11-12-26(41-32(47)24-7-5-8-25(19-24)34(35,36)37)20-28(23)43-33-42-27-9-3-4-10-29(27)46(33)31-21-30(39-22-40-31)38-13-6-14-45-17-15-44(2)16-18-45/h3-5,7-12,19-22H,6,13-18H2,1-2H3,(H,41,47)(H,42,43)(H,38,39,40)
Reactome pathway
n/an/a 149n/an/an/an/an/an/a
Genomics Institute of the Novartis Research Foundation (GNF)
Curated by ChEMBL
Assay Description
Inhibition of Tel-fused LYN expressed in mouse BAF3 cells
Bioorg Med Chem Lett 19: 6691-5 (2009)
Article DOI: 10.1016/j.bmcl.2009.09.123
BindingDB Entry DOI: 10.7270/Q2Q52PRR
Tyrosine-protein kinase HCK
(Homo sapiens (Human))
BDBM50311893
(CHEMBL1076478 | N-(4-methyl-3-(1-(6-(3-(4-methylpi...)
Show SMILES CN1CCN(CCCNc2cc(ncn2)-n2c(Nc3cc(NC(=O)c4cccc(c4)C(F)(F)F)ccc3C)nc3ccccc23)CC1
Show InChI InChI=1S/C34H36F3N9O/c1-23-11-12-26(41-32(47)24-7-5-8-25(19-24)34(35,36)37)20-28(23)43-33-42-27-9-3-4-10-29(27)46(33)31-21-30(39-22-40-31)38-13-6-14-45-17-15-44(2)16-18-45/h3-5,7-12,19-22H,6,13-18H2,1-2H3,(H,41,47)(H,42,43)(H,38,39,40)
Reactome pathway
n/an/a 31n/an/an/an/an/an/a
Genomics Institute of the Novartis Research Foundation (GNF)
Curated by ChEMBL
Assay Description
Inhibition of HCK
Bioorg Med Chem Lett 19: 6691-5 (2009)
Article DOI: 10.1016/j.bmcl.2009.09.123
BindingDB Entry DOI: 10.7270/Q2Q52PRR