BDBM50312181 1-(3,4-dichlorophenyl)-3-(3-(8-(pyridin-4-ylmethylamino)imidazo[1,2-a]pyrazin-6-yl)phenyl)urea::CHEMBL1081205
SMILES: Clc1ccc(NC(=O)Nc2cccc(c2)-c2cn3ccnc3c(NCc3ccncc3)n2)cc1Cl
InChI Key: InChIKey=SQEOHTQTMJDMFM-UHFFFAOYSA-N
Data: 1 IC50
Activity Spreadsheet -- Enzyme Inhibition Constant Data from BindingDB
Found 1 hit for monomerid = 50312181
Trg + Lig
Ki
nM
ΔG°
kcal/mole
IC50
nM
Kd
nM
EC50/IC50
nM
koff
s-1
kon
M-1s-1
pHTemp
°C
Ephrin type-B receptor 4
(Homo sapiens (Human))
BDBM50312181
(1-(3,4-dichlorophenyl)-3-(3-(8-(pyridin-4-ylmethyl...)
Show SMILES Clc1ccc(NC(=O)Nc2cccc(c2)-c2cn3ccnc3c(NCc3ccncc3)n2)cc1Cl
Show InChI InChI=1S/C25H19Cl2N7O/c26-20-5-4-19(13-21(20)27)32-25(35)31-18-3-1-2-17(12-18)22-15-34-11-10-29-24(34)23(33-22)30-14-16-6-8-28-9-7-16/h1-13,15H,14H2,(H,30,33)(H2,31,32,35)
Reactome pathway
n/an/a 2.50E+3n/an/an/an/an/an/a
CGI Pharmaceuticals, Inc.
Curated by ChEMBL
Assay Description
Inhibition of EphB4 autophosphorylation by cell based assay
Bioorg Med Chem Lett 19: 6991-5 (2009)
Article DOI: 10.1016/j.bmcl.2009.10.037
BindingDB Entry DOI: 10.7270/Q2DR2VM3