BDBM50312183 1-(2,3-dichlorophenyl)-3-(3-(8-(pyridin-4-ylmethylamino)imidazo[1,2-a]pyrazin-6-yl)phenyl)urea::CHEMBL1081024
SMILES: Clc1cccc(NC(=O)Nc2cccc(c2)-c2cn3ccnc3c(NCc3ccncc3)n2)c1Cl
InChI Key: InChIKey=CFRIHIVPVMJLCD-UHFFFAOYSA-N
Data: 1 IC50
Activity Spreadsheet -- Enzyme Inhibition Constant Data from BindingDB
Found 1 hit for monomerid = 50312183
Trg + Lig
Ki
nM
ΔG°
kcal/mole
IC50
nM
Kd
nM
EC50/IC50
nM
koff
s-1
kon
M-1s-1
pHTemp
°C
Ephrin type-B receptor 4
(Homo sapiens (Human))
BDBM50312183
(1-(2,3-dichlorophenyl)-3-(3-(8-(pyridin-4-ylmethyl...)
Show SMILES Clc1cccc(NC(=O)Nc2cccc(c2)-c2cn3ccnc3c(NCc3ccncc3)n2)c1Cl
Show InChI InChI=1S/C25H19Cl2N7O/c26-19-5-2-6-20(22(19)27)33-25(35)31-18-4-1-3-17(13-18)21-15-34-12-11-29-24(34)23(32-21)30-14-16-7-9-28-10-8-16/h1-13,15H,14H2,(H,30,32)(H2,31,33,35)
Reactome pathway
n/an/a 5.70E+3n/an/an/an/an/an/a
CGI Pharmaceuticals, Inc.
Curated by ChEMBL
Assay Description
Inhibition of EphB4 autophosphorylation by cell based assay
Bioorg Med Chem Lett 19: 6991-5 (2009)
Article DOI: 10.1016/j.bmcl.2009.10.037
BindingDB Entry DOI: 10.7270/Q2DR2VM3