BDBM50312184 1-(2-hydroxy-5-(trifluoromethyl)phenyl)-3-(3-(8-(pyridin-4-ylmethylamino)imidazo[1,2-a]pyrazin-6-yl)phenyl)urea::CHEMBL1079448
SMILES: Oc1ccc(cc1NC(=O)Nc1cccc(c1)-c1cn2ccnc2c(NCc2ccncc2)n1)C(F)(F)F
InChI Key: InChIKey=OCOHRESDZFYIIC-UHFFFAOYSA-N
Data: 1 IC50
Activity Spreadsheet -- Enzyme Inhibition Constant Data from BindingDB
Found 1 hit for monomerid = 50312184
Trg + Lig
Ki
nM
ΔG°
kcal/mole
IC50
nM
Kd
nM
EC50/IC50
nM
koff
s-1
kon
M-1s-1
pHTemp
°C
Ephrin type-B receptor 4
(Homo sapiens (Human))
BDBM50312184
(1-(2-hydroxy-5-(trifluoromethyl)phenyl)-3-(3-(8-(p...)
Show SMILES Oc1ccc(cc1NC(=O)Nc1cccc(c1)-c1cn2ccnc2c(NCc2ccncc2)n1)C(F)(F)F
Show InChI InChI=1S/C26H20F3N7O2/c27-26(28,29)18-4-5-22(37)20(13-18)35-25(38)33-19-3-1-2-17(12-19)21-15-36-11-10-31-24(36)23(34-21)32-14-16-6-8-30-9-7-16/h1-13,15,37H,14H2,(H,32,34)(H2,33,35,38)
Reactome pathway
n/an/a 37n/an/an/an/an/an/a
CGI Pharmaceuticals, Inc.
Curated by ChEMBL
Assay Description
Inhibition of EphB4 autophosphorylation by cell based assay
Bioorg Med Chem Lett 19: 6991-5 (2009)
Article DOI: 10.1016/j.bmcl.2009.10.037
BindingDB Entry DOI: 10.7270/Q2DR2VM3