null
SMILES: COc1ccc(cc1)-c1nc(COc2ccc(OCC(O)=O)c(C)c2)sc1-c1cccc2ccccc12
InChI Key: InChIKey=YGJIZLUQVPBHKD-UHFFFAOYSA-N
Activity Spreadsheet -- Enzyme Inhibition Constant Data from BindingDB
Found 3 hits for monomerid = 50312418
Trg + Lig
Ki
nM
ΔG°
kcal/mole
IC50
nM
Kd
nM
EC50/IC50
nM
koff
s-1
kon
M-1s-1
pHTemp
°C
Peroxisome proliferator-activated receptor delta
(Homo sapiens (Human))
BDBM50312418
(2-(4-((4-(4-Methoxyphenyl)-5-(naphthalen-1-yl)thia...)
Show SMILES COc1ccc(cc1)-c1nc(COc2ccc(OCC(O)=O)c(C)c2)sc1-c1cccc2ccccc12
Show InChI InChI=1S/C30H25NO5S/c1-19-16-23(14-15-26(19)36-18-28(32)33)35-17-27-31-29(21-10-12-22(34-2)13-11-21)30(37-27)25-9-5-7-20-6-3-4-8-24(20)25/h3-16H,17-18H2,1-2H3,(H,32,33)
n/an/an/an/a>1.00E+4n/an/an/an/a
The Genomics Institute of the Novartis Research Foundation
Curated by ChEMBL
Assay Description
Agonist activity at human PPARdelta ligand binding domain expressed in human 293T cells cotransfected with Gal4-DBD by luciferase transactivation ass...
J Med Chem 53: 77-105 (2010)
Article DOI: 10.1021/jm9007399
BindingDB Entry DOI: 10.7270/Q28052RP
Peroxisome proliferator-activated receptor gamma
(Homo sapiens (Human))
BDBM50312418
(2-(4-((4-(4-Methoxyphenyl)-5-(naphthalen-1-yl)thia...)
Show SMILES COc1ccc(cc1)-c1nc(COc2ccc(OCC(O)=O)c(C)c2)sc1-c1cccc2ccccc12
Show InChI InChI=1S/C30H25NO5S/c1-19-16-23(14-15-26(19)36-18-28(32)33)35-17-27-31-29(21-10-12-22(34-2)13-11-21)30(37-27)25-9-5-7-20-6-3-4-8-24(20)25/h3-16H,17-18H2,1-2H3,(H,32,33)
NCI pathway
Reactome pathway
n/an/an/an/a>1.00E+4n/an/an/an/a
The Genomics Institute of the Novartis Research Foundation
Curated by ChEMBL
Assay Description
Agonist activity at human PPARgamma ligand binding domain expressed in human 293T cells cotransfected with Gal4-DBD by luciferase transactivation ass...
J Med Chem 53: 77-105 (2010)
Article DOI: 10.1021/jm9007399
BindingDB Entry DOI: 10.7270/Q28052RP
Peroxisome proliferator-activated receptor alpha
(Homo sapiens (Human))
BDBM50312418
(2-(4-((4-(4-Methoxyphenyl)-5-(naphthalen-1-yl)thia...)
Show SMILES COc1ccc(cc1)-c1nc(COc2ccc(OCC(O)=O)c(C)c2)sc1-c1cccc2ccccc12
Show InChI InChI=1S/C30H25NO5S/c1-19-16-23(14-15-26(19)36-18-28(32)33)35-17-27-31-29(21-10-12-22(34-2)13-11-21)30(37-27)25-9-5-7-20-6-3-4-8-24(20)25/h3-16H,17-18H2,1-2H3,(H,32,33)
n/an/an/an/a>1.00E+4n/an/an/an/a
The Genomics Institute of the Novartis Research Foundation
Curated by ChEMBL
Assay Description
Agonist activity at human PPARalpha ligand binding domain expressed in human 293T cells cotransfected with Gal4-DBD by luciferase transactivation ass...
J Med Chem 53: 77-105 (2010)
Article DOI: 10.1021/jm9007399
BindingDB Entry DOI: 10.7270/Q28052RP