null
SMILES: COc1ccc(cc1)-c1nc(CSc2ccc(OCC(O)=O)c(C)c2)sc1-c1ccc(OC)cc1
InChI Key: InChIKey=MFHVRCZFXZJHFV-UHFFFAOYSA-N
Activity Spreadsheet -- Enzyme Inhibition Constant Data from BindingDB
Found 3 hits for monomerid = 50312449
Trg + Lig
Ki
nM
ΔG°
kcal/mole
IC50
nM
Kd
nM
EC50/IC50
nM
koff
s-1
kon
M-1s-1
pHTemp
°C
Peroxisome proliferator-activated receptor alpha
(Homo sapiens (Human))
BDBM50312449
(2-(4-((4,5-Bis(4-methoxyphenyl)thiazol-2-yl)methyl...)
Show SMILES COc1ccc(cc1)-c1nc(CSc2ccc(OCC(O)=O)c(C)c2)sc1-c1ccc(OC)cc1
Show InChI InChI=1S/C27H25NO5S2/c1-17-14-22(12-13-23(17)33-15-25(29)30)34-16-24-28-26(18-4-8-20(31-2)9-5-18)27(35-24)19-6-10-21(32-3)11-7-19/h4-14H,15-16H2,1-3H3,(H,29,30)
n/an/an/an/a>1.00E+4n/an/an/an/a
The Genomics Institute of the Novartis Research Foundation
Curated by ChEMBL
Assay Description
Agonist activity at human PPARalpha ligand binding domain expressed in human 293T cells cotransfected with Gal4-DBD by luciferase transactivation ass...
J Med Chem 53: 77-105 (2010)
Article DOI: 10.1021/jm9007399
BindingDB Entry DOI: 10.7270/Q28052RP
Peroxisome proliferator-activated receptor delta
(Homo sapiens (Human))
BDBM50312449
(2-(4-((4,5-Bis(4-methoxyphenyl)thiazol-2-yl)methyl...)
Show SMILES COc1ccc(cc1)-c1nc(CSc2ccc(OCC(O)=O)c(C)c2)sc1-c1ccc(OC)cc1
Show InChI InChI=1S/C27H25NO5S2/c1-17-14-22(12-13-23(17)33-15-25(29)30)34-16-24-28-26(18-4-8-20(31-2)9-5-18)27(35-24)19-6-10-21(32-3)11-7-19/h4-14H,15-16H2,1-3H3,(H,29,30)
n/an/an/an/a 470n/an/an/an/a
The Genomics Institute of the Novartis Research Foundation
Curated by ChEMBL
Assay Description
Agonist activity at human PPARdelta ligand binding domain expressed in human 293T cells cotransfected with Gal4-DBD by luciferase transactivation ass...
J Med Chem 53: 77-105 (2010)
Article DOI: 10.1021/jm9007399
BindingDB Entry DOI: 10.7270/Q28052RP
Peroxisome proliferator-activated receptor gamma
(Homo sapiens (Human))
BDBM50312449
(2-(4-((4,5-Bis(4-methoxyphenyl)thiazol-2-yl)methyl...)
Show SMILES COc1ccc(cc1)-c1nc(CSc2ccc(OCC(O)=O)c(C)c2)sc1-c1ccc(OC)cc1
Show InChI InChI=1S/C27H25NO5S2/c1-17-14-22(12-13-23(17)33-15-25(29)30)34-16-24-28-26(18-4-8-20(31-2)9-5-18)27(35-24)19-6-10-21(32-3)11-7-19/h4-14H,15-16H2,1-3H3,(H,29,30)
NCI pathway
Reactome pathway
n/an/an/an/a>1.00E+4n/an/an/an/a
The Genomics Institute of the Novartis Research Foundation
Curated by ChEMBL
Assay Description
Agonist activity at human PPARgamma ligand binding domain expressed in human 293T cells cotransfected with Gal4-DBD by luciferase transactivation ass...
J Med Chem 53: 77-105 (2010)
Article DOI: 10.1021/jm9007399
BindingDB Entry DOI: 10.7270/Q28052RP