null
SMILES: COc1ccc(cc1)-c1nc(SCCCCOc2ccc(OCC(O)=O)c(C)c2)sc1-c1ccc(OC)cc1
InChI Key: InChIKey=LAFZAKOTAAWTHM-UHFFFAOYSA-N
Activity Spreadsheet -- Enzyme Inhibition Constant Data from BindingDB
Found 3 hits for monomerid = 50312457
Trg + Lig
Ki
nM
ΔG°
kcal/mole
IC50
nM
Kd
nM
EC50/IC50
nM
koff
s-1
kon
M-1s-1
pHTemp
°C
Peroxisome proliferator-activated receptor gamma
(Homo sapiens (Human))
BDBM50312457
(2-(4-(4-(4,5-Bis(4-methoxyphenyl)thiazol-2-ylthio)...)
Show SMILES COc1ccc(cc1)-c1nc(SCCCCOc2ccc(OCC(O)=O)c(C)c2)sc1-c1ccc(OC)cc1
Show InChI InChI=1S/C30H31NO6S2/c1-20-18-25(14-15-26(20)37-19-27(32)33)36-16-4-5-17-38-30-31-28(21-6-10-23(34-2)11-7-21)29(39-30)22-8-12-24(35-3)13-9-22/h6-15,18H,4-5,16-17,19H2,1-3H3,(H,32,33)
NCI pathway
Reactome pathway
n/an/an/an/a 6.36E+3n/an/an/an/a
The Genomics Institute of the Novartis Research Foundation
Curated by ChEMBL
Assay Description
Agonist activity at human PPARgamma ligand binding domain expressed in human 293T cells cotransfected with Gal4-DBD by luciferase transactivation ass...
J Med Chem 53: 77-105 (2010)
Article DOI: 10.1021/jm9007399
BindingDB Entry DOI: 10.7270/Q28052RP
Peroxisome proliferator-activated receptor alpha
(Homo sapiens (Human))
BDBM50312457
(2-(4-(4-(4,5-Bis(4-methoxyphenyl)thiazol-2-ylthio)...)
Show SMILES COc1ccc(cc1)-c1nc(SCCCCOc2ccc(OCC(O)=O)c(C)c2)sc1-c1ccc(OC)cc1
Show InChI InChI=1S/C30H31NO6S2/c1-20-18-25(14-15-26(20)37-19-27(32)33)36-16-4-5-17-38-30-31-28(21-6-10-23(34-2)11-7-21)29(39-30)22-8-12-24(35-3)13-9-22/h6-15,18H,4-5,16-17,19H2,1-3H3,(H,32,33)
n/an/an/an/a 2.37E+3n/an/an/an/a
The Genomics Institute of the Novartis Research Foundation
Curated by ChEMBL
Assay Description
Agonist activity at human PPARalpha ligand binding domain expressed in human 293T cells cotransfected with Gal4-DBD by luciferase transactivation ass...
J Med Chem 53: 77-105 (2010)
Article DOI: 10.1021/jm9007399
BindingDB Entry DOI: 10.7270/Q28052RP
Peroxisome proliferator-activated receptor delta
(Homo sapiens (Human))
BDBM50312457
(2-(4-(4-(4,5-Bis(4-methoxyphenyl)thiazol-2-ylthio)...)
Show SMILES COc1ccc(cc1)-c1nc(SCCCCOc2ccc(OCC(O)=O)c(C)c2)sc1-c1ccc(OC)cc1
Show InChI InChI=1S/C30H31NO6S2/c1-20-18-25(14-15-26(20)37-19-27(32)33)36-16-4-5-17-38-30-31-28(21-6-10-23(34-2)11-7-21)29(39-30)22-8-12-24(35-3)13-9-22/h6-15,18H,4-5,16-17,19H2,1-3H3,(H,32,33)
n/an/an/an/a>1.00E+4n/an/an/an/a
The Genomics Institute of the Novartis Research Foundation
Curated by ChEMBL
Assay Description
Agonist activity at human PPARdelta ligand binding domain expressed in human 293T cells cotransfected with Gal4-DBD by luciferase transactivation ass...
J Med Chem 53: 77-105 (2010)
Article DOI: 10.1021/jm9007399
BindingDB Entry DOI: 10.7270/Q28052RP