null
SMILES: COc1ccc(cc1)-c1nc(Sc2cccc(c2)C(C)C(O)=O)sc1-c1ccc(OC)cc1
InChI Key: InChIKey=ZSFPEKCUUMNHFE-UHFFFAOYSA-N
Activity Spreadsheet -- Enzyme Inhibition Constant Data from BindingDB
Found 3 hits for monomerid = 50312466
Trg + Lig
Ki
nM
ΔG°
kcal/mole
IC50
nM
Kd
nM
EC50/IC50
nM
koff
s-1
kon
M-1s-1
pHTemp
°C
Peroxisome proliferator-activated receptor alpha
(Homo sapiens (Human))
BDBM50312466
(2-(3-(4,5-bis(4-methoxyphenyl)thiazol-2-ylthio)phe...)
Show SMILES COc1ccc(cc1)-c1nc(Sc2cccc(c2)C(C)C(O)=O)sc1-c1ccc(OC)cc1
Show InChI InChI=1S/C26H23NO4S2/c1-16(25(28)29)19-5-4-6-22(15-19)32-26-27-23(17-7-11-20(30-2)12-8-17)24(33-26)18-9-13-21(31-3)14-10-18/h4-16H,1-3H3,(H,28,29)
n/an/an/an/a 300n/an/an/an/a
The Genomics Institute of the Novartis Research Foundation
Curated by ChEMBL
Assay Description
Agonist activity at human PPARalpha ligand binding domain expressed in human 293T cells cotransfected with Gal4-DBD by luciferase transactivation ass...
J Med Chem 53: 77-105 (2010)
Article DOI: 10.1021/jm9007399
BindingDB Entry DOI: 10.7270/Q28052RP
Peroxisome proliferator-activated receptor delta
(Homo sapiens (Human))
BDBM50312466
(2-(3-(4,5-bis(4-methoxyphenyl)thiazol-2-ylthio)phe...)
Show SMILES COc1ccc(cc1)-c1nc(Sc2cccc(c2)C(C)C(O)=O)sc1-c1ccc(OC)cc1
Show InChI InChI=1S/C26H23NO4S2/c1-16(25(28)29)19-5-4-6-22(15-19)32-26-27-23(17-7-11-20(30-2)12-8-17)24(33-26)18-9-13-21(31-3)14-10-18/h4-16H,1-3H3,(H,28,29)
n/an/an/an/a 3.20E+3n/an/an/an/a
The Genomics Institute of the Novartis Research Foundation
Curated by ChEMBL
Assay Description
Agonist activity at human PPARdelta ligand binding domain expressed in human 293T cells cotransfected with Gal4-DBD by luciferase transactivation ass...
J Med Chem 53: 77-105 (2010)
Article DOI: 10.1021/jm9007399
BindingDB Entry DOI: 10.7270/Q28052RP
Peroxisome proliferator-activated receptor gamma
(Homo sapiens (Human))
BDBM50312466
(2-(3-(4,5-bis(4-methoxyphenyl)thiazol-2-ylthio)phe...)
Show SMILES COc1ccc(cc1)-c1nc(Sc2cccc(c2)C(C)C(O)=O)sc1-c1ccc(OC)cc1
Show InChI InChI=1S/C26H23NO4S2/c1-16(25(28)29)19-5-4-6-22(15-19)32-26-27-23(17-7-11-20(30-2)12-8-17)24(33-26)18-9-13-21(31-3)14-10-18/h4-16H,1-3H3,(H,28,29)
NCI pathway
Reactome pathway
n/an/an/an/a 2.30E+3n/an/an/an/a
The Genomics Institute of the Novartis Research Foundation
Curated by ChEMBL
Assay Description
Agonist activity at human PPARgamma ligand binding domain expressed in human 293T cells cotransfected with Gal4-DBD by luciferase transactivation ass...
J Med Chem 53: 77-105 (2010)
Article DOI: 10.1021/jm9007399
BindingDB Entry DOI: 10.7270/Q28052RP