BDBM50312468 2-(4-((4-(4-Isopropoxyphenyl)-5-(3-(trifluoromethoxy)phenyl)-thiazol-2-yl)methoxy)-2-methylphenoxy)acetic Acid::CHEMBL1080822
SMILES: CC(C)Oc1ccc(cc1)-c1nc(COc2ccc(OCC(O)=O)c(C)c2)sc1-c1cccc(OC(F)(F)F)c1
InChI Key: InChIKey=FMBDSCXDWQLLHZ-UHFFFAOYSA-N
Data: 3 EC50
Activity Spreadsheet -- Enzyme Inhibition Constant Data from BindingDB
Found 3 hits for monomerid = 50312468
Trg + Lig
Ki
nM
ΔG°
kcal/mole
IC50
nM
Kd
nM
EC50/IC50
nM
koff
s-1
kon
M-1s-1
pHTemp
°C
Peroxisome proliferator-activated receptor delta
(Homo sapiens (Human))
BDBM50312468
(2-(4-((4-(4-Isopropoxyphenyl)-5-(3-(trifluorometho...)
Show SMILES CC(C)Oc1ccc(cc1)-c1nc(COc2ccc(OCC(O)=O)c(C)c2)sc1-c1cccc(OC(F)(F)F)c1
Show InChI InChI=1S/C29H26F3NO6S/c1-17(2)38-21-9-7-19(8-10-21)27-28(20-5-4-6-23(14-20)39-29(30,31)32)40-25(33-27)15-36-22-11-12-24(18(3)13-22)37-16-26(34)35/h4-14,17H,15-16H2,1-3H3,(H,34,35)
n/an/an/an/a 16n/an/an/an/a
The Genomics Institute of the Novartis Research Foundation
Curated by ChEMBL
Assay Description
Agonist activity at human PPARdelta ligand binding domain by FRET assay
J Med Chem 53: 77-105 (2010)
Article DOI: 10.1021/jm9007399
BindingDB Entry DOI: 10.7270/Q28052RP
Peroxisome proliferator-activated receptor delta
(Homo sapiens (Human))
BDBM50312468
(2-(4-((4-(4-Isopropoxyphenyl)-5-(3-(trifluorometho...)
Show SMILES CC(C)Oc1ccc(cc1)-c1nc(COc2ccc(OCC(O)=O)c(C)c2)sc1-c1cccc(OC(F)(F)F)c1
Show InChI InChI=1S/C29H26F3NO6S/c1-17(2)38-21-9-7-19(8-10-21)27-28(20-5-4-6-23(14-20)39-29(30,31)32)40-25(33-27)15-36-22-11-12-24(18(3)13-22)37-16-26(34)35/h4-14,17H,15-16H2,1-3H3,(H,34,35)
n/an/an/an/a 9n/an/an/an/a
The Genomics Institute of the Novartis Research Foundation
Curated by ChEMBL
Assay Description
Agonist activity at human PPARdelta ligand binding domain expressed in human 293T cells cotransfected with Gal4-DBD by luciferase transactivation ass...
J Med Chem 53: 77-105 (2010)
Article DOI: 10.1021/jm9007399
BindingDB Entry DOI: 10.7270/Q28052RP
Peroxisome proliferator-activated receptor delta
(Mus musculus)
BDBM50312468
(2-(4-((4-(4-Isopropoxyphenyl)-5-(3-(trifluorometho...)
Show SMILES CC(C)Oc1ccc(cc1)-c1nc(COc2ccc(OCC(O)=O)c(C)c2)sc1-c1cccc(OC(F)(F)F)c1
Show InChI InChI=1S/C29H26F3NO6S/c1-17(2)38-21-9-7-19(8-10-21)27-28(20-5-4-6-23(14-20)39-29(30,31)32)40-25(33-27)15-36-22-11-12-24(18(3)13-22)37-16-26(34)35/h4-14,17H,15-16H2,1-3H3,(H,34,35)
Reactome pathway
n/an/an/an/a 46n/an/an/an/a
The Genomics Institute of the Novartis Research Foundation
Curated by ChEMBL
Assay Description
Agonist activity at mouse PPARdelta by FRET assay
J Med Chem 53: 77-105 (2010)
Article DOI: 10.1021/jm9007399
BindingDB Entry DOI: 10.7270/Q28052RP