BDBM50312855 (2S,2'S)-N,N'-((4S,4'S)-2,2'-(2,2'-(ethane-1,2-diylbis(azanediyl))bis(2-oxoethane-2,1-diyl))bis(3-oxo-2,3,4,5-tetrahydro-1H-benzo[c]azepine-4,2-diyl))bis(2-amino-3-(4-hydroxy-2,6-dimethylphenyl)propanamide)::CHEMBL1076737
SMILES: Cc1cc(O)cc(C)c1C[C@H](N)C(=O)N[C@H]1Cc2ccccc2CN(CC(=O)NCCNC(=O)CN2Cc3ccccc3C[C@H](NC(=O)[C@@H](N)Cc3c(C)cc(O)cc3C)C2=O)C1=O
InChI Key: InChIKey=RADODKJLZRLHCQ-IWWWZYECSA-N
Data: 2 KI  2 IC50
Activity Spreadsheet -- Enzyme Inhibition Constant Data from BindingDB
Found 4 hits for monomerid = 50312855
Trg + Lig
Ki
nM
ΔG°
kcal/mole
IC50
nM
Kd
nM
EC50/IC50
nM
koff
s-1
kon
M-1s-1
pHTemp
°C
Mu-type opioid receptor
(Rattus norvegicus (rat))
BDBM50312855
((2S,2'S)-N,N'-((4S,4'S)-2,2'-(2,2'-(ethane-1,2-diy...)
Show SMILES Cc1cc(O)cc(C)c1C[C@H](N)C(=O)N[C@H]1Cc2ccccc2CN(CC(=O)NCCNC(=O)CN2Cc3ccccc3C[C@H](NC(=O)[C@@H](N)Cc3c(C)cc(O)cc3C)C2=O)C1=O |r|
Show InChI InChI=1S/C48H58N8O8/c1-27-15-35(57)16-28(2)37(27)21-39(49)45(61)53-41-19-31-9-5-7-11-33(31)23-55(47(41)63)25-43(59)51-13-14-52-44(60)26-56-24-34-12-8-6-10-32(34)20-42(48(56)64)54-46(62)40(50)22-38-29(3)17-36(58)18-30(38)4/h5-12,15-18,39-42,57-58H,13-14,19-26,49-50H2,1-4H3,(H,51,59)(H,52,60)(H,53,61)(H,54,62)/t39-,40-,41-,42-/m0/s1
Reactome pathway
16n/an/an/an/an/an/an/an/a
Vrije Universiteit Brussel
Curated by ChEMBL
Assay Description
Displacement of [3H]DAMGO from mu opioid receptor in rat brain membranes
Bioorg Med Chem Lett 20: 1610-3 (2010)
Article DOI: 10.1016/j.bmcl.2010.01.055
BindingDB Entry DOI: 10.7270/Q2H995BB
Opioid receptors; mu & delta
(Rattus norvegicus (rat))
BDBM50312855
((2S,2'S)-N,N'-((4S,4'S)-2,2'-(2,2'-(ethane-1,2-diy...)
Show SMILES Cc1cc(O)cc(C)c1C[C@H](N)C(=O)N[C@H]1Cc2ccccc2CN(CC(=O)NCCNC(=O)CN2Cc3ccccc3C[C@H](NC(=O)[C@@H](N)Cc3c(C)cc(O)cc3C)C2=O)C1=O |r|
Show InChI InChI=1S/C48H58N8O8/c1-27-15-35(57)16-28(2)37(27)21-39(49)45(61)53-41-19-31-9-5-7-11-33(31)23-55(47(41)63)25-43(59)51-13-14-52-44(60)26-56-24-34-12-8-6-10-32(34)20-42(48(56)64)54-46(62)40(50)22-38-29(3)17-36(58)18-30(38)4/h5-12,15-18,39-42,57-58H,13-14,19-26,49-50H2,1-4H3,(H,51,59)(H,52,60)(H,53,61)(H,54,62)/t39-,40-,41-,42-/m0/s1
Reactome pathway
154n/an/an/an/an/an/an/an/a
Vrije Universiteit Brussel
Curated by ChEMBL
Assay Description
Displacement of [3H]deltorphin 2 from delta opioid receptor in rat brain membranes
Bioorg Med Chem Lett 20: 1610-3 (2010)
Article DOI: 10.1016/j.bmcl.2010.01.055
BindingDB Entry DOI: 10.7270/Q2H995BB
Delta-type opioid receptor
(MOUSE)
BDBM50312855
((2S,2'S)-N,N'-((4S,4'S)-2,2'-(2,2'-(ethane-1,2-diy...)
Show SMILES Cc1cc(O)cc(C)c1C[C@H](N)C(=O)N[C@H]1Cc2ccccc2CN(CC(=O)NCCNC(=O)CN2Cc3ccccc3C[C@H](NC(=O)[C@@H](N)Cc3c(C)cc(O)cc3C)C2=O)C1=O |r|
Show InChI InChI=1S/C48H58N8O8/c1-27-15-35(57)16-28(2)37(27)21-39(49)45(61)53-41-19-31-9-5-7-11-33(31)23-55(47(41)63)25-43(59)51-13-14-52-44(60)26-56-24-34-12-8-6-10-32(34)20-42(48(56)64)54-46(62)40(50)22-38-29(3)17-36(58)18-30(38)4/h5-12,15-18,39-42,57-58H,13-14,19-26,49-50H2,1-4H3,(H,51,59)(H,52,60)(H,53,61)(H,54,62)/t39-,40-,41-,42-/m0/s1
Reactome pathway
n/an/a>1.00E+4n/an/an/an/an/an/a
Vrije Universiteit Brussel
Curated by ChEMBL
Assay Description
Antagonist activity at delta opioid receptor in mouse vas deferens
Bioorg Med Chem Lett 20: 1610-3 (2010)
Article DOI: 10.1016/j.bmcl.2010.01.055
BindingDB Entry DOI: 10.7270/Q2H995BB
Mu-type opioid receptor
(GUINEA PIG)
BDBM50312855
((2S,2'S)-N,N'-((4S,4'S)-2,2'-(2,2'-(ethane-1,2-diy...)
Show SMILES Cc1cc(O)cc(C)c1C[C@H](N)C(=O)N[C@H]1Cc2ccccc2CN(CC(=O)NCCNC(=O)CN2Cc3ccccc3C[C@H](NC(=O)[C@@H](N)Cc3c(C)cc(O)cc3C)C2=O)C1=O |r|
Show InChI InChI=1S/C48H58N8O8/c1-27-15-35(57)16-28(2)37(27)21-39(49)45(61)53-41-19-31-9-5-7-11-33(31)23-55(47(41)63)25-43(59)51-13-14-52-44(60)26-56-24-34-12-8-6-10-32(34)20-42(48(56)64)54-46(62)40(50)22-38-29(3)17-36(58)18-30(38)4/h5-12,15-18,39-42,57-58H,13-14,19-26,49-50H2,1-4H3,(H,51,59)(H,52,60)(H,53,61)(H,54,62)/t39-,40-,41-,42-/m0/s1
n/an/a>1.00E+4n/an/an/an/an/an/a
Vrije Universiteit Brussel
Curated by ChEMBL
Assay Description
Antagonist activity at mu opioid receptor in guinea pig ileum
Bioorg Med Chem Lett 20: 1610-3 (2010)
Article DOI: 10.1016/j.bmcl.2010.01.055
BindingDB Entry DOI: 10.7270/Q2H995BB