BDBM50312908 2-(2-(diphenylamino)-4-(4-fluorophenyl)thiazol-5-yl)acetic acid::CHEMBL1080695
SMILES: OC(=O)Cc1sc(nc1-c1ccc(F)cc1)N(c1ccccc1)c1ccccc1
InChI Key: InChIKey=PONILUFZRIPFJP-UHFFFAOYSA-N
Data: 2 IC50
Activity Spreadsheet -- Enzyme Inhibition Constant Data from BindingDB
Found 2 hits for monomerid = 50312908
Trg + Lig
Ki
nM
ΔG°
kcal/mole
IC50
nM
Kd
nM
EC50/IC50
nM
koff
s-1
kon
M-1s-1
pHTemp
°C
G protein-coupled receptor 44
(Homo sapiens (Human))
BDBM50312908
(2-(2-(diphenylamino)-4-(4-fluorophenyl)thiazol-5-y...)
Show SMILES OC(=O)Cc1sc(nc1-c1ccc(F)cc1)N(c1ccccc1)c1ccccc1
Show InChI InChI=1S/C23H17FN2O2S/c24-17-13-11-16(12-14-17)22-20(15-21(27)28)29-23(25-22)26(18-7-3-1-4-8-18)19-9-5-2-6-10-19/h1-14H,15H2,(H,27,28)
Reactome pathway
n/an/a 0.0980n/an/an/an/an/an/a
7TM Pharma A/S
Curated by ChEMBL
Assay Description
Antagonist activity at human CRTH2 receptor expressed in HEK385-7 cells assessed as inhibition of PGD2-mediated beta-arrestin translocation preincuba...
Bioorg Med Chem Lett 20: 1638-41 (2010)
Article DOI: 10.1016/j.bmcl.2010.01.092
BindingDB Entry DOI: 10.7270/Q2416X6B
G protein-coupled receptor 44
(Homo sapiens (Human))
BDBM50312908
(2-(2-(diphenylamino)-4-(4-fluorophenyl)thiazol-5-y...)
Show SMILES OC(=O)Cc1sc(nc1-c1ccc(F)cc1)N(c1ccccc1)c1ccccc1
Show InChI InChI=1S/C23H17FN2O2S/c24-17-13-11-16(12-14-17)22-20(15-21(27)28)29-23(25-22)26(18-7-3-1-4-8-18)19-9-5-2-6-10-19/h1-14H,15H2,(H,27,28)
Reactome pathway
n/an/a 15n/an/an/an/an/an/a
7TM Pharma A/S
Curated by ChEMBL
Assay Description
Displacement of [3H]PGD2 from human CRTH2 receptor expressed in HEK385-7 cells
Bioorg Med Chem Lett 20: 1638-41 (2010)
Article DOI: 10.1016/j.bmcl.2010.01.092
BindingDB Entry DOI: 10.7270/Q2416X6B