BDBM50312980 CHEMBL1081977::N-(4-(2-(3,4,5-trimethoxyphenylamino)benzo[d]oxazol-7-yl)phenyl)methanesulfonamide
SMILES: COc1cc(Nc2nc3cccc(-c4ccc(NS(C)(=O)=O)cc4)c3o2)cc(OC)c1OC
InChI Key: InChIKey=JRRYENJTDMKDRR-UHFFFAOYSA-N
Data: 4 IC50
Activity Spreadsheet -- Enzyme Inhibition Constant Data from BindingDB
Found 4 hits for monomerid = 50312980
Trg + Lig
Ki
nM
ΔG°
kcal/mole
IC50
nM
Kd
nM
EC50/IC50
nM
koff
s-1
kon
M-1s-1
pHTemp
°C
Tyrosine-protein kinase JAK2
(Homo sapiens (Human))
BDBM50312980
(CHEMBL1081977 | N-(4-(2-(3,4,5-trimethoxyphenylami...)
Show SMILES COc1cc(Nc2nc3cccc(-c4ccc(NS(C)(=O)=O)cc4)c3o2)cc(OC)c1OC
Show InChI InChI=1S/C23H23N3O6S/c1-29-19-12-16(13-20(30-2)22(19)31-3)24-23-25-18-7-5-6-17(21(18)32-23)14-8-10-15(11-9-14)26-33(4,27)28/h5-13,26H,1-4H3,(H,24,25)
Reactome pathway
n/an/a 5n/an/an/an/an/an/a
Novartis Institutes for BioMedical Research
Curated by ChEMBL
Assay Description
Inhibition of GST-tagged JAK2 assessed as inhibition of biotinylated JAK3tide peptide phosphorylation after 60 mins by caliper mobility shift assay
Bioorg Med Chem Lett 20: 1724-7 (2010)
Article DOI: 10.1016/j.bmcl.2010.01.069
BindingDB Entry DOI: 10.7270/Q2M32VW0
Non-receptor tyrosine-protein kinase TYK2
(Homo sapiens (Human))
BDBM50312980
(CHEMBL1081977 | N-(4-(2-(3,4,5-trimethoxyphenylami...)
Show SMILES COc1cc(Nc2nc3cccc(-c4ccc(NS(C)(=O)=O)cc4)c3o2)cc(OC)c1OC
Show InChI InChI=1S/C23H23N3O6S/c1-29-19-12-16(13-20(30-2)22(19)31-3)24-23-25-18-7-5-6-17(21(18)32-23)14-8-10-15(11-9-14)26-33(4,27)28/h5-13,26H,1-4H3,(H,24,25)
n/an/a 150n/an/an/an/an/an/a
Novartis Institutes for BioMedical Research
Curated by ChEMBL
Assay Description
Inhibition of GST-tagged TYK2 assessed as inhibition of biotinylated IRS1 substrate phosphorylation after 60 mins by caliper mobility shift assay
Bioorg Med Chem Lett 20: 1724-7 (2010)
Article DOI: 10.1016/j.bmcl.2010.01.069
BindingDB Entry DOI: 10.7270/Q2M32VW0
Tyrosine-protein kinase JAK3
(Homo sapiens (Human))
BDBM50312980
(CHEMBL1081977 | N-(4-(2-(3,4,5-trimethoxyphenylami...)
Show SMILES COc1cc(Nc2nc3cccc(-c4ccc(NS(C)(=O)=O)cc4)c3o2)cc(OC)c1OC
Show InChI InChI=1S/C23H23N3O6S/c1-29-19-12-16(13-20(30-2)22(19)31-3)24-23-25-18-7-5-6-17(21(18)32-23)14-8-10-15(11-9-14)26-33(4,27)28/h5-13,26H,1-4H3,(H,24,25)
Reactome pathway
n/an/a 130n/an/an/an/an/an/a
Novartis Institutes for BioMedical Research
Curated by ChEMBL
Assay Description
Inhibition of GST-tagged JAK3 assessed as inhibition of biotinylated JAK3tide peptide phosphorylation after 60 mins by caliper mobility shift assay
Bioorg Med Chem Lett 20: 1724-7 (2010)
Article DOI: 10.1016/j.bmcl.2010.01.069
BindingDB Entry DOI: 10.7270/Q2M32VW0
Tyrosine-protein kinase JAK1
(Homo sapiens (Human))
BDBM50312980
(CHEMBL1081977 | N-(4-(2-(3,4,5-trimethoxyphenylami...)
Show SMILES COc1cc(Nc2nc3cccc(-c4ccc(NS(C)(=O)=O)cc4)c3o2)cc(OC)c1OC
Show InChI InChI=1S/C23H23N3O6S/c1-29-19-12-16(13-20(30-2)22(19)31-3)24-23-25-18-7-5-6-17(21(18)32-23)14-8-10-15(11-9-14)26-33(4,27)28/h5-13,26H,1-4H3,(H,24,25)
Reactome pathway
n/an/a 47n/an/an/an/an/an/a
Novartis Institutes for BioMedical Research
Curated by ChEMBL
Assay Description
Inhibition of GST-tagged JAK1 assessed as inhibition of biotinylated IRS1 substrate phosphorylation after 60 mins by caliper mobility shift assay
Bioorg Med Chem Lett 20: 1724-7 (2010)
Article DOI: 10.1016/j.bmcl.2010.01.069
BindingDB Entry DOI: 10.7270/Q2M32VW0