BDBM50312981 CHEMBL1081978::morpholino(4-(2-(3,4,5-trimethoxyphenylamino)benzo[d]oxazol-7-yl)phenyl)methanone
SMILES: COc1cc(Nc2nc3cccc(-c4ccc(cc4)C(=O)N4CCOCC4)c3o2)cc(OC)c1OC
InChI Key: InChIKey=RGJMICFWNAVTAA-UHFFFAOYSA-N
Data: 4 IC50
Activity Spreadsheet -- Enzyme Inhibition Constant Data from BindingDB
Found 4 hits for monomerid = 50312981
Trg + Lig
Ki
nM
ΔG°
kcal/mole
IC50
nM
Kd
nM
EC50/IC50
nM
koff
s-1
kon
M-1s-1
pHTemp
°C
Tyrosine-protein kinase JAK2
(Homo sapiens (Human))
BDBM50312981
(CHEMBL1081978 | morpholino(4-(2-(3,4,5-trimethoxyp...)
Show SMILES COc1cc(Nc2nc3cccc(-c4ccc(cc4)C(=O)N4CCOCC4)c3o2)cc(OC)c1OC
Show InChI InChI=1S/C27H27N3O6/c1-32-22-15-19(16-23(33-2)25(22)34-3)28-27-29-21-6-4-5-20(24(21)36-27)17-7-9-18(10-8-17)26(31)30-11-13-35-14-12-30/h4-10,15-16H,11-14H2,1-3H3,(H,28,29)
Reactome pathway
n/an/a 8n/an/an/an/an/an/a
Novartis Institutes for BioMedical Research
Curated by ChEMBL
Assay Description
Inhibition of GST-tagged JAK2 assessed as inhibition of biotinylated JAK3tide peptide phosphorylation after 60 mins by caliper mobility shift assay
Bioorg Med Chem Lett 20: 1724-7 (2010)
Article DOI: 10.1016/j.bmcl.2010.01.069
BindingDB Entry DOI: 10.7270/Q2M32VW0
Non-receptor tyrosine-protein kinase TYK2
(Homo sapiens (Human))
BDBM50312981
(CHEMBL1081978 | morpholino(4-(2-(3,4,5-trimethoxyp...)
Show SMILES COc1cc(Nc2nc3cccc(-c4ccc(cc4)C(=O)N4CCOCC4)c3o2)cc(OC)c1OC
Show InChI InChI=1S/C27H27N3O6/c1-32-22-15-19(16-23(33-2)25(22)34-3)28-27-29-21-6-4-5-20(24(21)36-27)17-7-9-18(10-8-17)26(31)30-11-13-35-14-12-30/h4-10,15-16H,11-14H2,1-3H3,(H,28,29)
n/an/a 110n/an/an/an/an/an/a
Novartis Institutes for BioMedical Research
Curated by ChEMBL
Assay Description
Inhibition of GST-tagged TYK2 assessed as inhibition of biotinylated IRS1 substrate phosphorylation after 60 mins by caliper mobility shift assay
Bioorg Med Chem Lett 20: 1724-7 (2010)
Article DOI: 10.1016/j.bmcl.2010.01.069
BindingDB Entry DOI: 10.7270/Q2M32VW0
Tyrosine-protein kinase JAK3
(Homo sapiens (Human))
BDBM50312981
(CHEMBL1081978 | morpholino(4-(2-(3,4,5-trimethoxyp...)
Show SMILES COc1cc(Nc2nc3cccc(-c4ccc(cc4)C(=O)N4CCOCC4)c3o2)cc(OC)c1OC
Show InChI InChI=1S/C27H27N3O6/c1-32-22-15-19(16-23(33-2)25(22)34-3)28-27-29-21-6-4-5-20(24(21)36-27)17-7-9-18(10-8-17)26(31)30-11-13-35-14-12-30/h4-10,15-16H,11-14H2,1-3H3,(H,28,29)
Reactome pathway
n/an/a 400n/an/an/an/an/an/a
Novartis Institutes for BioMedical Research
Curated by ChEMBL
Assay Description
Inhibition of GST-tagged JAK3 assessed as inhibition of biotinylated JAK3tide peptide phosphorylation after 60 mins by caliper mobility shift assay
Bioorg Med Chem Lett 20: 1724-7 (2010)
Article DOI: 10.1016/j.bmcl.2010.01.069
BindingDB Entry DOI: 10.7270/Q2M32VW0
Tyrosine-protein kinase JAK1
(Homo sapiens (Human))
BDBM50312981
(CHEMBL1081978 | morpholino(4-(2-(3,4,5-trimethoxyp...)
Show SMILES COc1cc(Nc2nc3cccc(-c4ccc(cc4)C(=O)N4CCOCC4)c3o2)cc(OC)c1OC
Show InChI InChI=1S/C27H27N3O6/c1-32-22-15-19(16-23(33-2)25(22)34-3)28-27-29-21-6-4-5-20(24(21)36-27)17-7-9-18(10-8-17)26(31)30-11-13-35-14-12-30/h4-10,15-16H,11-14H2,1-3H3,(H,28,29)
Reactome pathway
n/an/a 27.5n/an/an/an/an/an/a
Novartis Institutes for BioMedical Research
Curated by ChEMBL
Assay Description
Inhibition of GST-tagged JAK1 assessed as inhibition of biotinylated IRS1 substrate phosphorylation after 60 mins by caliper mobility shift assay
Bioorg Med Chem Lett 20: 1724-7 (2010)
Article DOI: 10.1016/j.bmcl.2010.01.069
BindingDB Entry DOI: 10.7270/Q2M32VW0