BDBM50312994 3-(1-methyl-1H-indol-3-yl)-4-(phenylamino)-1H-pyrrole-2,5-dione::CHEMBL1086734::ROCHE screening, 39
SMILES: Cn1cc(C2=C(Nc3ccccc3)C(=O)NC2=O)c2ccccc12
InChI Key: InChIKey=JJNQVVXLJXQVLY-UHFFFAOYSA-N
Data: 2 IC50
Activity Spreadsheet -- Enzyme Inhibition Constant Data from BindingDB
Found 2 hits for monomerid = 50312994
Trg + Lig
Ki
nM
ΔG°
kcal/mole
IC50
nM
Kd
nM
EC50/IC50
nM
koff
s-1
kon
M-1s-1
pHTemp
°C
Glycogen synthase kinase-3 beta
(Homo sapiens (Human))
BDBM50312994
(3-(1-methyl-1H-indol-3-yl)-4-(phenylamino)-1H-pyrr...)
Show SMILES Cn1cc(C2=C(Nc3ccccc3)C(=O)NC2=O)c2ccccc12 |c:4|
Show InChI InChI=1S/C19H15N3O2/c1-22-11-14(13-9-5-6-10-15(13)22)16-17(19(24)21-18(16)23)20-12-7-3-2-4-8-12/h2-11H,1H3,(H2,20,21,23,24)
NCI pathway
Reactome pathway
n/an/a 350n/an/an/an/an/an/a
Roche Palo Alto
Curated by ChEMBL
Assay Description
Inhibition of human recombinant GSK3-beta assessed as [gamma33]ATP transfer to biotinylated CREB-peptide substrate after 1 hr by scintillation counti...
Bioorg Med Chem Lett 20: 1693-6 (2010)
Article DOI: 10.1016/j.bmcl.2010.01.038
BindingDB Entry DOI: 10.7270/Q2ZK5HNS
Protein cereblon/Serine/threonine-protein kinase TBK1
(Homo sapiens (Human))
BDBM50312994
(3-(1-methyl-1H-indol-3-yl)-4-(phenylamino)-1H-pyrr...)
Show SMILES Cn1cc(C2=C(Nc3ccccc3)C(=O)NC2=O)c2ccccc12 |c:4|
Show InChI InChI=1S/C19H15N3O2/c1-22-11-14(13-9-5-6-10-15(13)22)16-17(19(24)21-18(16)23)20-12-7-3-2-4-8-12/h2-11H,1H3,(H2,20,21,23,24)
n/an/a 231n/an/an/an/an/an/a
Technical University of Dortmund
Assay Description
IC50 determinations for TBK1 were performed with the KinEASE-STK assay from Cisbio according to the manufacturer's instructions. A biotinylated s...
ACS Chem Biol 10: 289-98 (2015)
Article DOI: 10.1021/cb500908d
BindingDB Entry DOI: 10.7270/Q2WH2NRB