BDBM50313003 3-(5-chloro-1-methyl-1H-indol-3-yl)-4-(3-methoxyphenyl)-1H-pyrrole-2,5-dione::CHEMBL1081617
SMILES: COc1cccc(c1)C1=C(C(=O)NC1=O)c1cn(C)c2ccc(Cl)cc12
InChI Key: InChIKey=AKGYFGPTGCPJOY-UHFFFAOYSA-N
Data: 2 IC50
Activity Spreadsheet -- Enzyme Inhibition Constant Data from BindingDB
Found 2 hits for monomerid = 50313003
Trg + Lig
Ki
nM
ΔG°
kcal/mole
IC50
nM
Kd
nM
EC50/IC50
nM
koff
s-1
kon
M-1s-1
pHTemp
°C
Glycogen synthase kinase-3 beta
(Homo sapiens (Human))
BDBM50313003
(3-(5-chloro-1-methyl-1H-indol-3-yl)-4-(3-methoxyph...)
Show SMILES COc1cccc(c1)C1=C(C(=O)NC1=O)c1cn(C)c2ccc(Cl)cc12 |t:9|
Show InChI InChI=1S/C20H15ClN2O3/c1-23-10-15(14-9-12(21)6-7-16(14)23)18-17(19(24)22-20(18)25)11-4-3-5-13(8-11)26-2/h3-10H,1-2H3,(H,22,24,25)
NCI pathway
Reactome pathway
n/an/a 6.40n/an/an/an/an/an/a
Roche Palo Alto
Curated by ChEMBL
Assay Description
Inhibition of human recombinant GSK3-beta assessed as [gamma33]ATP transfer to biotinylated CREB-peptide substrate after 1 hr by scintillation counti...
Bioorg Med Chem Lett 20: 1693-6 (2010)
Article DOI: 10.1016/j.bmcl.2010.01.038
BindingDB Entry DOI: 10.7270/Q2ZK5HNS
Protein kinase C alpha type
(Homo sapiens (Human))
BDBM50313003
(3-(5-chloro-1-methyl-1H-indol-3-yl)-4-(3-methoxyph...)
Show SMILES COc1cccc(c1)C1=C(C(=O)NC1=O)c1cn(C)c2ccc(Cl)cc12 |t:9|
Show InChI InChI=1S/C20H15ClN2O3/c1-23-10-15(14-9-12(21)6-7-16(14)23)18-17(19(24)22-20(18)25)11-4-3-5-13(8-11)26-2/h3-10H,1-2H3,(H,22,24,25)
NCI pathway
Reactome pathway
n/an/a 1.40E+3n/an/an/an/an/an/a
Roche Palo Alto
Curated by ChEMBL
Assay Description
Inhibition of PKCalpha
Bioorg Med Chem Lett 20: 1693-6 (2010)
Article DOI: 10.1016/j.bmcl.2010.01.038
BindingDB Entry DOI: 10.7270/Q2ZK5HNS