BDBM50313010 3-(2,4-dimethoxyphenyl)-4-(1-methyl-1H-indol-3-yl)-1H-pyrrole-2,5-dione::CHEMBL1088149
SMILES: COc1ccc(C2=C(C(=O)NC2=O)c2cn(C)c3ccccc23)c(OC)c1
InChI Key: InChIKey=OFSMRZJPTZGSGH-UHFFFAOYSA-N
Data: 2 IC50
Activity Spreadsheet -- Enzyme Inhibition Constant Data from BindingDB
Found 2 hits for monomerid = 50313010
Trg + Lig
Ki
nM
ΔG°
kcal/mole
IC50
nM
Kd
nM
EC50/IC50
nM
koff
s-1
kon
M-1s-1
pHTemp
°C
Glycogen synthase kinase-3 beta
(Homo sapiens (Human))
BDBM50313010
(3-(2,4-dimethoxyphenyl)-4-(1-methyl-1H-indol-3-yl)...)
Show SMILES COc1ccc(C2=C(C(=O)NC2=O)c2cn(C)c3ccccc23)c(OC)c1 |t:6|
Show InChI InChI=1S/C21H18N2O4/c1-23-11-15(13-6-4-5-7-16(13)23)19-18(20(24)22-21(19)25)14-9-8-12(26-2)10-17(14)27-3/h4-11H,1-3H3,(H,22,24,25)
NCI pathway
Reactome pathway
n/an/a 2.40n/an/an/an/an/an/a
Roche Palo Alto
Curated by ChEMBL
Assay Description
Inhibition of human recombinant GSK3-beta assessed as [gamma33]ATP transfer to biotinylated CREB-peptide substrate after 1 hr by scintillation counti...
Bioorg Med Chem Lett 20: 1693-6 (2010)
Article DOI: 10.1016/j.bmcl.2010.01.038
BindingDB Entry DOI: 10.7270/Q2ZK5HNS
Protein kinase C alpha type
(Homo sapiens (Human))
BDBM50313010
(3-(2,4-dimethoxyphenyl)-4-(1-methyl-1H-indol-3-yl)...)
Show SMILES COc1ccc(C2=C(C(=O)NC2=O)c2cn(C)c3ccccc23)c(OC)c1 |t:6|
Show InChI InChI=1S/C21H18N2O4/c1-23-11-15(13-6-4-5-7-16(13)23)19-18(20(24)22-21(19)25)14-9-8-12(26-2)10-17(14)27-3/h4-11H,1-3H3,(H,22,24,25)
NCI pathway
Reactome pathway
n/an/a 5.50E+3n/an/an/an/an/an/a
Roche Palo Alto
Curated by ChEMBL
Assay Description
Inhibition of PKCalpha
Bioorg Med Chem Lett 20: 1693-6 (2010)
Article DOI: 10.1016/j.bmcl.2010.01.038
BindingDB Entry DOI: 10.7270/Q2ZK5HNS