BDBM50313179 (R)-2-((S)-1-ethyl-3-methyl-4-(4-(trifluoromethyl)phenethyl)-6,7-dihydro-1H-pyrazolo[4,3-c]pyridin-5(4H)-yl)-N-methyl-2-phenylacetamide::CHEMBL1081252
SMILES: CCn1nc(C)c2[C@H](CCc3ccc(cc3)C(F)(F)F)N(CCc12)[C@@H](C(=O)NC)c1ccccc1
InChI Key: InChIKey=VDTFQQQTVJPZLY-WIOPSUGQSA-N
Data: 2 IC50
Activity Spreadsheet -- Enzyme Inhibition Constant Data from BindingDB
Found 2 hits for monomerid = 50313179
Trg + Lig
Ki
nM
ΔG°
kcal/mole
IC50
nM
Kd
nM
EC50/IC50
nM
koff
s-1
kon
M-1s-1
pHTemp
°C
Orexin receptor type 2
(Homo sapiens (Human))
BDBM50313179
((R)-2-((S)-1-ethyl-3-methyl-4-(4-(trifluoromethyl)...)
Show SMILES CCn1nc(C)c2[C@H](CCc3ccc(cc3)C(F)(F)F)N(CCc12)[C@@H](C(=O)NC)c1ccccc1 |r|
Show InChI InChI=1S/C27H31F3N4O/c1-4-34-23-16-17-33(25(26(35)31-3)20-8-6-5-7-9-20)22(24(23)18(2)32-34)15-12-19-10-13-21(14-11-19)27(28,29)30/h5-11,13-14,22,25H,4,12,15-17H2,1-3H3,(H,31,35)/t22-,25+/m0/s1
Reactome pathway
n/an/a 3n/an/an/an/an/an/a
Actelion Pharmaceuticals Ltd
Curated by ChEMBL
Assay Description
Antagonist activity at human OX2 receptor expressed in CHO cells assessed as inhibition of calcium mobilization by FLIPR assay
Bioorg Med Chem Lett 20: 1539-42 (2010)
Article DOI: 10.1016/j.bmcl.2010.01.070
BindingDB Entry DOI: 10.7270/Q2FB5324
Orexin receptor type 1
(Homo sapiens (Human))
BDBM50313179
((R)-2-((S)-1-ethyl-3-methyl-4-(4-(trifluoromethyl)...)
Show SMILES CCn1nc(C)c2[C@H](CCc3ccc(cc3)C(F)(F)F)N(CCc12)[C@@H](C(=O)NC)c1ccccc1 |r|
Show InChI InChI=1S/C27H31F3N4O/c1-4-34-23-16-17-33(25(26(35)31-3)20-8-6-5-7-9-20)22(24(23)18(2)32-34)15-12-19-10-13-21(14-11-19)27(28,29)30/h5-11,13-14,22,25H,4,12,15-17H2,1-3H3,(H,31,35)/t22-,25+/m0/s1
Reactome pathway
n/an/a 128n/an/an/an/an/an/a
Actelion Pharmaceuticals Ltd
Curated by ChEMBL
Assay Description
Antagonist activity at human OX1 receptor expressed in CHO cells assessed as inhibition of calcium mobilization by FLIPR assay
Bioorg Med Chem Lett 20: 1539-42 (2010)
Article DOI: 10.1016/j.bmcl.2010.01.070
BindingDB Entry DOI: 10.7270/Q2FB5324