BDBM50313224 5-(4-tert-butylphenyl)-1-(4-isopropoxyphenyl)-1H-indole-2-carboxylic acid::CHEMBL1076694
SMILES: CC(C)Oc1ccc(cc1)-n1c(cc2cc(ccc12)-c1ccc(cc1)C(C)(C)C)C(O)=O
InChI Key: InChIKey=GUMCVDVWBMLUSQ-UHFFFAOYSA-N
Data: 3 IC50
PDB links: 1 PDB ID matches this monomer.
Activity Spreadsheet -- Enzyme Inhibition Constant Data from BindingDB
Found 3 hits for monomerid = 50313224
Trg + Lig
Ki
nM
ΔG°
kcal/mole
IC50
nM
Kd
nM
EC50/IC50
nM
koff
s-1
kon
M-1s-1
pHTemp
°C
Prostaglandin E synthase
(Homo sapiens (Human))
BDBM50313224
(5-(4-tert-butylphenyl)-1-(4-isopropoxyphenyl)-1H-i...)
Show SMILES CC(C)Oc1ccc(cc1)-n1c(cc2cc(ccc12)-c1ccc(cc1)C(C)(C)C)C(O)=O
Show InChI InChI=1S/C28H29NO3/c1-18(2)32-24-13-11-23(12-14-24)29-25-15-8-20(16-21(25)17-26(29)27(30)31)19-6-9-22(10-7-19)28(3,4)5/h6-18H,1-5H3,(H,30,31)
Reactome pathway
n/an/a 216n/an/an/an/an/an/a
Lilly Biotechnology Center San Diego
Curated by ChEMBL
Assay Description
Inhibition of recombinant human mPGES-1 expressed in human 293E cell microsomes using PGH2 as substrate assessed as PGE2 production after 2.5 mins by...
J Med Chem 58: 4727-37 (2015)
Article DOI: 10.1021/acs.jmedchem.5b00330
BindingDB Entry DOI: 10.7270/Q23J3FQ0
3D
3D Structure (crystal)
Prostaglandin E synthase
(Homo sapiens (Human))
BDBM50313224
(5-(4-tert-butylphenyl)-1-(4-isopropoxyphenyl)-1H-i...)
Show SMILES CC(C)Oc1ccc(cc1)-n1c(cc2cc(ccc12)-c1ccc(cc1)C(C)(C)C)C(O)=O
Show InChI InChI=1S/C28H29NO3/c1-18(2)32-24-13-11-23(12-14-24)29-25-15-8-20(16-21(25)17-26(29)27(30)31)19-6-9-22(10-7-19)28(3,4)5/h6-18H,1-5H3,(H,30,31)
Reactome pathway
n/an/a 62n/an/an/an/an/an/a
Pfizer Inc. St. Louis Laboratory
Curated by ChEMBL
Assay Description
Inhibition of human mPGES1 assessed as PGE2 level after 41 sec by ELISA
Bioorg Med Chem Lett 20: 1604-9 (2010)
Article DOI: 10.1016/j.bmcl.2010.01.060
BindingDB Entry DOI: 10.7270/Q25X292V
3D
3D Structure (crystal)
Prostaglandin E synthase
(Homo sapiens (Human))
BDBM50313224
(5-(4-tert-butylphenyl)-1-(4-isopropoxyphenyl)-1H-i...)
Show SMILES CC(C)Oc1ccc(cc1)-n1c(cc2cc(ccc12)-c1ccc(cc1)C(C)(C)C)C(O)=O
Show InChI InChI=1S/C28H29NO3/c1-18(2)32-24-13-11-23(12-14-24)29-25-15-8-20(16-21(25)17-26(29)27(30)31)19-6-9-22(10-7-19)28(3,4)5/h6-18H,1-5H3,(H,30,31)
Reactome pathway
n/an/a 2.58E+3n/an/an/an/an/an/a
Lilly Biotechnology Center San Diego
Curated by ChEMBL
Assay Description
Inhibition of purified mPGES-1 (1 to 152) (unknown origin) extracted from detergent-solubilized baculovirus-infected insect Sf9 cell membranes using ...
J Med Chem 58: 4727-37 (2015)
Article DOI: 10.1021/acs.jmedchem.5b00330
BindingDB Entry DOI: 10.7270/Q23J3FQ0
3D
3D Structure (crystal)