BDBM50313316 6-(cyclopentylamino)-N-(4-hydroxyphenyl)pyrimidine-4-carboxamide::CHEMBL1080748::US9150519, 1-3
SMILES: Oc1ccc(NC(=O)c2cc(NC3CCCC3)ncn2)cc1
InChI Key: InChIKey=UNXZSIPDGFTOFF-UHFFFAOYSA-N
Data: 1 KI  2 EC50
Activity Spreadsheet -- Enzyme Inhibition Constant Data from BindingDB
Found 3 hits for monomerid = 50313316
Trg + Lig
Ki
nM
ΔG°
kcal/mole
IC50
nM
Kd
nM
EC50/IC50
nM
koff
s-1
kon
M-1s-1
pHTemp
°C
Sphingosine 1-phosphate receptor 1
(Homo sapiens (Human))
BDBM50313316
(6-(cyclopentylamino)-N-(4-hydroxyphenyl)pyrimidine...)
Show SMILES Oc1ccc(NC(=O)c2cc(NC3CCCC3)ncn2)cc1
Show InChI InChI=1S/C16H18N4O2/c21-13-7-5-12(6-8-13)20-16(22)14-9-15(18-10-17-14)19-11-3-1-2-4-11/h5-11,21H,1-4H2,(H,20,22)(H,17,18,19)
Reactome pathway
US Patent
2.13E+3 -7.19n/an/an/an/an/a7.44
MERCK SERONO SA
US Patent
Assay Description
Membranes were prepared from CHO cells expressing S1P1 or S1P3 for use in ligand and 35S-GTPgammaS binding studies. Cells were suspended in 50 mM TRI...
US Patent US9150519 (2015)
BindingDB Entry DOI: 10.7270/Q2H993ZK
Sphingosine 1-phosphate receptor 1
(Homo sapiens (Human))
BDBM50313316
(6-(cyclopentylamino)-N-(4-hydroxyphenyl)pyrimidine...)
Show SMILES Oc1ccc(NC(=O)c2cc(NC3CCCC3)ncn2)cc1
Show InChI InChI=1S/C16H18N4O2/c21-13-7-5-12(6-8-13)20-16(22)14-9-15(18-10-17-14)19-11-3-1-2-4-11/h5-11,21H,1-4H2,(H,20,22)(H,17,18,19)
Reactome pathway
n/an/an/an/a 1.67E+4n/an/an/an/a
Merck Serono SA
Curated by ChEMBL
Assay Description
Agonist activity at S1P1 receptor expressed in CHO cells after 60 mins by [35S]-GTPgammaS binding assay
Bioorg Med Chem Lett 20: 1516-9 (2010)
Article DOI: 10.1016/j.bmcl.2010.01.102
BindingDB Entry DOI: 10.7270/Q2J38SQK
Sphingosine 1-phosphate receptor 1
(Homo sapiens (Human))
BDBM50313316
(6-(cyclopentylamino)-N-(4-hydroxyphenyl)pyrimidine...)
Show SMILES Oc1ccc(NC(=O)c2cc(NC3CCCC3)ncn2)cc1
Show InChI InChI=1S/C16H18N4O2/c21-13-7-5-12(6-8-13)20-16(22)14-9-15(18-10-17-14)19-11-3-1-2-4-11/h5-11,21H,1-4H2,(H,20,22)(H,17,18,19)
Reactome pathway
US Patent
n/an/an/an/a 1.67E+4n/an/a7.430
MERCK SERONO SA
US Patent
Assay Description
Measurements of 35S-GTPgammaS Binding: Membranes (1 to 10 µg protein) prepared as described above, were incubated in 96-well Scintiplates (PerkinElm...
US Patent US9150519 (2015)
BindingDB Entry DOI: 10.7270/Q2H993ZK