BDBM50313342 CHEMBL1087785::N-(4-carbamoylphenyl)-6-(cyclohexyl(cyclopropylmethyl)amino)pyrimidine-4-carboxamide::US9150519, 1-50
SMILES: NC(=O)c1ccc(NC(=O)c2cc(ncn2)N(CC2CC2)C2CCCCC2)cc1
InChI Key: InChIKey=RVGPRODDRDZBQK-UHFFFAOYSA-N
Data: 2 EC50
Activity Spreadsheet -- Enzyme Inhibition Constant Data from BindingDB
Found 2 hits for monomerid = 50313342
Trg + Lig
Ki
nM
ΔG°
kcal/mole
IC50
nM
Kd
nM
EC50/IC50
nM
koff
s-1
kon
M-1s-1
pHTemp
°C
Sphingosine 1-phosphate receptor 1
(Homo sapiens (Human))
BDBM50313342
(CHEMBL1087785 | N-(4-carbamoylphenyl)-6-(cyclohexy...)
Show SMILES NC(=O)c1ccc(NC(=O)c2cc(ncn2)N(CC2CC2)C2CCCCC2)cc1
Show InChI InChI=1S/C22H27N5O2/c23-21(28)16-8-10-17(11-9-16)26-22(29)19-12-20(25-14-24-19)27(13-15-6-7-15)18-4-2-1-3-5-18/h8-12,14-15,18H,1-7,13H2,(H2,23,28)(H,26,29)
Reactome pathway
n/an/an/an/a 73n/an/an/an/a
Merck Serono SA
Curated by ChEMBL
Assay Description
Agonist activity at S1P1 receptor expressed in CHO cells after 60 mins by [35S]-GTPgammaS binding assay
Bioorg Med Chem Lett 20: 1516-9 (2010)
Article DOI: 10.1016/j.bmcl.2010.01.102
BindingDB Entry DOI: 10.7270/Q2J38SQK
Sphingosine 1-phosphate receptor 1
(Homo sapiens (Human))
BDBM50313342
(CHEMBL1087785 | N-(4-carbamoylphenyl)-6-(cyclohexy...)
Show SMILES NC(=O)c1ccc(NC(=O)c2cc(ncn2)N(CC2CC2)C2CCCCC2)cc1
Show InChI InChI=1S/C22H27N5O2/c23-21(28)16-8-10-17(11-9-16)26-22(29)19-12-20(25-14-24-19)27(13-15-6-7-15)18-4-2-1-3-5-18/h8-12,14-15,18H,1-7,13H2,(H2,23,28)(H,26,29)
Reactome pathway
US Patent
n/an/an/an/a 73n/an/a7.430
MERCK SERONO SA
US Patent
Assay Description
Measurements of 35S-GTPgammaS Binding: Membranes (1 to 10 µg protein) prepared as described above, were incubated in 96-well Scintiplates (PerkinElm...
US Patent US9150519 (2015)
BindingDB Entry DOI: 10.7270/Q2H993ZK