BDBM50313346 6-(cyclohexylamino)-N-(1H-indazol-5-yl)pyrimidine-4-carboxamide::CHEMBL1087282::US9150519, 1-28
SMILES: O=C(Nc1ccc2[nH]ncc2c1)c1cc(NC2CCCCC2)ncn1
InChI Key: InChIKey=UGDQLQZVEPFUKQ-UHFFFAOYSA-N
Data: 1 KI  3 EC50
Activity Spreadsheet -- Enzyme Inhibition Constant Data from BindingDB
Found 4 hits for monomerid = 50313346
Trg + Lig
Ki
nM
ΔG°
kcal/mole
IC50
nM
Kd
nM
EC50/IC50
nM
koff
s-1
kon
M-1s-1
pHTemp
°C
Sphingosine 1-phosphate receptor 1
(Homo sapiens (Human))
BDBM50313346
(6-(cyclohexylamino)-N-(1H-indazol-5-yl)pyrimidine-...)
Show SMILES O=C(Nc1ccc2[nH]ncc2c1)c1cc(NC2CCCCC2)ncn1
Show InChI InChI=1S/C18H20N6O/c25-18(23-14-6-7-15-12(8-14)10-21-24-15)16-9-17(20-11-19-16)22-13-4-2-1-3-5-13/h6-11,13H,1-5H2,(H,21,24)(H,23,25)(H,19,20,22)
Reactome pathway
US Patent
458 -8.03n/an/an/an/an/a7.44
MERCK SERONO SA
US Patent
Assay Description
Membranes were prepared from CHO cells expressing S1P1 or S1P3 for use in ligand and 35S-GTPgammaS binding studies. Cells were suspended in 50 mM TRI...
US Patent US9150519 (2015)
BindingDB Entry DOI: 10.7270/Q2H993ZK
Sphingosine 1-phosphate receptor 3
(Homo sapiens (Human))
BDBM50313346
(6-(cyclohexylamino)-N-(1H-indazol-5-yl)pyrimidine-...)
Show SMILES O=C(Nc1ccc2[nH]ncc2c1)c1cc(NC2CCCCC2)ncn1
Show InChI InChI=1S/C18H20N6O/c25-18(23-14-6-7-15-12(8-14)10-21-24-15)16-9-17(20-11-19-16)22-13-4-2-1-3-5-13/h6-11,13H,1-5H2,(H,21,24)(H,23,25)(H,19,20,22)
NCI pathway
Reactome pathway
US Patent
n/an/an/an/a>3.00E+4n/an/a7.430
MERCK SERONO SA
US Patent
Assay Description
Measurements of 35S-GTPgammaS Binding: Membranes (1 to 10 µg protein) prepared as described above, were incubated in 96-well Scintiplates (PerkinElm...
US Patent US9150519 (2015)
BindingDB Entry DOI: 10.7270/Q2H993ZK
Sphingosine 1-phosphate receptor 1
(Homo sapiens (Human))
BDBM50313346
(6-(cyclohexylamino)-N-(1H-indazol-5-yl)pyrimidine-...)
Show SMILES O=C(Nc1ccc2[nH]ncc2c1)c1cc(NC2CCCCC2)ncn1
Show InChI InChI=1S/C18H20N6O/c25-18(23-14-6-7-15-12(8-14)10-21-24-15)16-9-17(20-11-19-16)22-13-4-2-1-3-5-13/h6-11,13H,1-5H2,(H,21,24)(H,23,25)(H,19,20,22)
Reactome pathway
n/an/an/an/a 2.71E+3n/an/an/an/a
Merck Serono SA
Curated by ChEMBL
Assay Description
Agonist activity at S1P1 receptor expressed in CHO cells after 60 mins by [35S]-GTPgammaS binding assay
Bioorg Med Chem Lett 20: 1516-9 (2010)
Article DOI: 10.1016/j.bmcl.2010.01.102
BindingDB Entry DOI: 10.7270/Q2J38SQK
Sphingosine 1-phosphate receptor 1
(Homo sapiens (Human))
BDBM50313346
(6-(cyclohexylamino)-N-(1H-indazol-5-yl)pyrimidine-...)
Show SMILES O=C(Nc1ccc2[nH]ncc2c1)c1cc(NC2CCCCC2)ncn1
Show InChI InChI=1S/C18H20N6O/c25-18(23-14-6-7-15-12(8-14)10-21-24-15)16-9-17(20-11-19-16)22-13-4-2-1-3-5-13/h6-11,13H,1-5H2,(H,21,24)(H,23,25)(H,19,20,22)
Reactome pathway
US Patent
n/an/an/an/a 2.71E+3n/an/a7.430
MERCK SERONO SA
US Patent
Assay Description
Measurements of 35S-GTPgammaS Binding: Membranes (1 to 10 µg protein) prepared as described above, were incubated in 96-well Scintiplates (PerkinElm...
US Patent US9150519 (2015)
BindingDB Entry DOI: 10.7270/Q2H993ZK