BDBM50313364 (2S,3R,4R,5S,6R)-2-(3-(4-ethylbenzyl)-4-methylphenyl)-6-(hydroxymethyl)tetrahydro-2H-pyran-3,4,5-triol::CHEMBL1086408
SMILES: CCc1ccc(Cc2cc(ccc2C)[C@@H]2O[C@H](CO)[C@@H](O)[C@H](O)[C@H]2O)cc1
InChI Key: InChIKey=IOUMMDDMHYSAMP-BDHVOXNPSA-N
Data: 2 IC50  1 EC50
Activity Spreadsheet -- Enzyme Inhibition Constant Data from BindingDB
Found 3 hits for monomerid = 50313364
Trg + Lig
Ki
nM
ΔG°
kcal/mole
IC50
nM
Kd
nM
EC50/IC50
nM
koff
s-1
kon
M-1s-1
pHTemp
°C
Sodium/glucose cotransporter 2
(Homo sapiens (Human))
BDBM50313364
((2S,3R,4R,5S,6R)-2-(3-(4-ethylbenzyl)-4-methylphen...)
Show SMILES CCc1ccc(Cc2cc(ccc2C)[C@@H]2O[C@H](CO)[C@@H](O)[C@H](O)[C@H]2O)cc1 |r|
Show InChI InChI=1S/C22H28O5/c1-3-14-5-7-15(8-6-14)10-17-11-16(9-4-13(17)2)22-21(26)20(25)19(24)18(12-23)27-22/h4-9,11,18-26H,3,10,12H2,1-2H3/t18-,19-,20+,21-,22+/m1/s1
n/an/a 1.5n/an/an/an/an/an/a
Pfizer Global Research& Development
Curated by ChEMBL
Assay Description
Inhibition of human SGLT2 expressed in CHO cells assessed as inhibition of sodium-dependent methyl-alpha-D-[U-14C]glucopyranoside uptake after 2 hrs
Bioorg Med Chem Lett 20: 1569-72 (2010)
Article DOI: 10.1016/j.bmcl.2010.01.075
BindingDB Entry DOI: 10.7270/Q2DF6RBP
Sodium/glucose cotransporter 2
(Homo sapiens (Human))
BDBM50313364
((2S,3R,4R,5S,6R)-2-(3-(4-ethylbenzyl)-4-methylphen...)
Show SMILES CCc1ccc(Cc2cc(ccc2C)[C@@H]2O[C@H](CO)[C@@H](O)[C@H](O)[C@H]2O)cc1 |r|
Show InChI InChI=1S/C22H28O5/c1-3-14-5-7-15(8-6-14)10-17-11-16(9-4-13(17)2)22-21(26)20(25)19(24)18(12-23)27-22/h4-9,11,18-26H,3,10,12H2,1-2H3/t18-,19-,20+,21-,22+/m1/s1
n/an/an/an/a 12n/an/an/an/a
National Health Research Institutes
Curated by ChEMBL
Assay Description
Inhibition of human SGLT2 expressed in CHO-K1 cells assessed as reduction in [14C]-alpha-methylglucopyranoside uptake after 2 hrs by liquid scintilla...
J Med Chem 53: 8770-4 (2010)
Article DOI: 10.1021/jm101080v
BindingDB Entry DOI: 10.7270/Q2N29X9T
Bcl-2-related protein A1
(Homo sapiens (Human))
BDBM50313364
((2S,3R,4R,5S,6R)-2-(3-(4-ethylbenzyl)-4-methylphen...)
Show SMILES CCc1ccc(Cc2cc(ccc2C)[C@@H]2O[C@H](CO)[C@@H](O)[C@H](O)[C@H]2O)cc1 |r|
Show InChI InChI=1S/C22H28O5/c1-3-14-5-7-15(8-6-14)10-17-11-16(9-4-13(17)2)22-21(26)20(25)19(24)18(12-23)27-22/h4-9,11,18-26H,3,10,12H2,1-2H3/t18-,19-,20+,21-,22+/m1/s1
NCI pathway
n/an/a 250n/an/an/an/an/an/a
Human BioMolecular Research Institute
Curated by ChEMBL
Assay Description
Inhibition of N-terminal FITC BH3 peptide binding to GST-tagged Bfl1 by fluorescence polarization assay
Bioorg Med Chem Lett 20: 6560-4 (2010)
Article DOI: 10.1016/j.bmcl.2010.09.046
BindingDB Entry DOI: 10.7270/Q27D2VCZ