BDBM50313384 (2S,3R,4R,5S,6S)-2-(4-chloro-3-(4-methoxybenzyl)phenyl)-6-(fluoromethyl)-5-methoxytetrahydro-2H-pyran-3,4-diol::CHEMBL1094712
SMILES: CO[C@H]1[C@H](O)[C@@H](O)[C@@H](O[C@@H]1CF)c1ccc(Cl)c(Cc2ccc(OC)cc2)c1
InChI Key: InChIKey=HWOLQSQGJBCFFY-SSSFQFABSA-N
Data: 1 IC50
Activity Spreadsheet -- Enzyme Inhibition Constant Data from BindingDB
Found 1 hit for monomerid = 50313384
Trg + Lig
Ki
nM
ΔG°
kcal/mole
IC50
nM
Kd
nM
EC50/IC50
nM
koff
s-1
kon
M-1s-1
pHTemp
°C
Sodium/glucose cotransporter 2
(Homo sapiens (Human))
BDBM50313384
((2S,3R,4R,5S,6S)-2-(4-chloro-3-(4-methoxybenzyl)ph...)
Show SMILES CO[C@H]1[C@H](O)[C@@H](O)[C@@H](O[C@@H]1CF)c1ccc(Cl)c(Cc2ccc(OC)cc2)c1 |r|
Show InChI InChI=1S/C21H24ClFO5/c1-26-15-6-3-12(4-7-15)9-14-10-13(5-8-16(14)22)20-18(24)19(25)21(27-2)17(11-23)28-20/h3-8,10,17-21,24-25H,9,11H2,1-2H3/t17-,18-,19-,20+,21-/m1/s1
n/an/a 5.10n/an/an/an/an/an/a
Pfizer Global Research& Development
Curated by ChEMBL
Assay Description
Inhibition of human SGLT2 expressed in CHO cells assessed as inhibition of sodium-dependent methyl-alpha-D-[U-14C]glucopyranoside uptake after 2 hrs
Bioorg Med Chem Lett 20: 1569-72 (2010)
Article DOI: 10.1016/j.bmcl.2010.01.075
BindingDB Entry DOI: 10.7270/Q2DF6RBP