BDBM50313433 CHEMBL1084431::N-(2-aminoethyl)-4-methyl-N-(((2R,4aS,5R,10bS)-5-phenyl-9-(trifluoromethyl)-3,4,4a,5,6,10b-hexahydro-2H-pyrano[3,2-c]quinolin-2-yl)methyl)benzamide
SMILES: Cc1ccc(cc1)C(=O)N(CCN)C[C@H]1CC[C@H]2[C@@H](Nc3ccc(cc3[C@H]2O1)C(F)(F)F)c1ccccc1
InChI Key: InChIKey=RAQSTOCPDXWQMP-JGPKDBRGSA-N
Data: 1 IC50
Activity Spreadsheet -- Enzyme Inhibition Constant Data from BindingDB
Found 1 hit for monomerid = 50313433
Trg + Lig
Ki
nM
ΔG°
kcal/mole
IC50
nM
Kd
nM
EC50/IC50
nM
koff
s-1
kon
M-1s-1
pHTemp
°C
Kinesin-like protein 1
(Homo sapiens (Human))
BDBM50313433
(CHEMBL1084431 | N-(2-aminoethyl)-4-methyl-N-(((2R,...)
Show SMILES Cc1ccc(cc1)C(=O)N(CCN)C[C@H]1CC[C@H]2[C@@H](Nc3ccc(cc3[C@H]2O1)C(F)(F)F)c1ccccc1 |r|
Show InChI InChI=1S/C30H32F3N3O2/c1-19-7-9-21(10-8-19)29(37)36(16-15-34)18-23-12-13-24-27(20-5-3-2-4-6-20)35-26-14-11-22(30(31,32)33)17-25(26)28(24)38-23/h2-11,14,17,23-24,27-28,35H,12-13,15-16,18,34H2,1H3/t23-,24+,27+,28+/m1/s1
Reactome pathway
n/an/a 65n/an/an/an/an/an/a
Merck Serono
Curated by ChEMBL
Assay Description
Inhibition of ATPase activity of human recombinant EG5 assessed as ATP hydrolysis by pyruvate kinase-lactate dehydrogenase coupled assay
Bioorg Med Chem Lett 20: 1491-5 (2010)
Article DOI: 10.1016/j.bmcl.2010.01.110
BindingDB Entry DOI: 10.7270/Q2KD1ZWN