BDBM50313437 1-((2R,4aS,5R,10bS)-9-tert-butyl-5-phenyl-3,4,4a,5,6,10b-hexahydro-2H-pyrano[3,2-c]quinolin-2-yl)-N-methylmethanamine::CHEMBL1086410
SMILES: CNC[C@H]1CC[C@H]2[C@@H](Nc3ccc(cc3[C@H]2O1)C(C)(C)C)c1ccccc1
InChI Key: InChIKey=WXIHHOOSOJQUAD-FUKQBSRTSA-N
Data: 1 IC50
Activity Spreadsheet -- Enzyme Inhibition Constant Data from BindingDB
Found 1 hit for monomerid = 50313437
Trg + Lig
Ki
nM
ΔG°
kcal/mole
IC50
nM
Kd
nM
EC50/IC50
nM
koff
s-1
kon
M-1s-1
pHTemp
°C
Kinesin-like protein 1
(Homo sapiens (Human))
BDBM50313437
(1-((2R,4aS,5R,10bS)-9-tert-butyl-5-phenyl-3,4,4a,5...)
Show SMILES CNC[C@H]1CC[C@H]2[C@@H](Nc3ccc(cc3[C@H]2O1)C(C)(C)C)c1ccccc1 |r|
Show InChI InChI=1S/C24H32N2O/c1-24(2,3)17-10-13-21-20(14-17)23-19(12-11-18(27-23)15-25-4)22(26-21)16-8-6-5-7-9-16/h5-10,13-14,18-19,22-23,25-26H,11-12,15H2,1-4H3/t18-,19+,22+,23+/m1/s1
Reactome pathway
n/an/a 4n/an/an/an/an/an/a
Merck Serono
Curated by ChEMBL
Assay Description
Inhibition of ATPase activity of human recombinant EG5 assessed as ATP hydrolysis by pyruvate kinase-lactate dehydrogenase coupled assay
Bioorg Med Chem Lett 20: 1491-5 (2010)
Article DOI: 10.1016/j.bmcl.2010.01.110
BindingDB Entry DOI: 10.7270/Q2KD1ZWN