null
SMILES: COC(=O)\C=C\C(=O)Nc1ccc(Cl)c(Cl)c1
InChI Key: InChIKey=BOYANPPIKWSQRQ-SNAWJCMRSA-N
Activity Spreadsheet -- Enzyme Inhibition Constant Data from BindingDB
Found 1 hit for monomerid = 50313448
Trg + Lig
Ki
nM
ΔG°
kcal/mole
IC50
nM
Kd
nM
EC50/IC50
nM
koff
s-1
kon
M-1s-1
pHTemp
°C
Glycylpeptide N-tetradecanoyltransferase 1
(Homo sapiens (Human))
BDBM50313448
((E)-methyl 4-(3,4-dichlorophenylamino)-4-oxobut-2-...)
Show SMILES COC(=O)\C=C\C(=O)Nc1ccc(Cl)c(Cl)c1
Show InChI InChI=1S/C11H9Cl2NO3/c1-17-11(16)5-4-10(15)14-7-2-3-8(12)9(13)6-7/h2-6H,1H3,(H,14,15)/b5-4+
Reactome pathway
n/an/a>8.00E+6n/an/an/an/an/an/a
Acadia University
Curated by ChEMBL
Assay Description
Inhibition of human NMT expressed in Escherichia coli DH5alpha cells
Bioorg Med Chem Lett 20: 1510-5 (2010)
Article DOI: 10.1016/j.bmcl.2010.01.098
BindingDB Entry DOI: 10.7270/Q28P60NS