null
SMILES: OC(=O)\C=C\C(=O)Nc1ccc(Cl)c(Cl)c1
InChI Key: InChIKey=YMYKNYVBUCMJOG-ONEGZZNKSA-N
Activity Spreadsheet -- Enzyme Inhibition Constant Data from BindingDB
Found 1 hit for monomerid = 50313453
Trg + Lig
Ki
nM
ΔG°
kcal/mole
IC50
nM
Kd
nM
EC50/IC50
nM
koff
s-1
kon
M-1s-1
pHTemp
°C
Glycylpeptide N-tetradecanoyltransferase 1
(Homo sapiens (Human))
BDBM50313453
((E)-4-(3,4-dichlorophenylamino)-4-oxobut-2-enoic a...)
Show SMILES OC(=O)\C=C\C(=O)Nc1ccc(Cl)c(Cl)c1
Show InChI InChI=1S/C10H7Cl2NO3/c11-7-2-1-6(5-8(7)12)13-9(14)3-4-10(15)16/h1-5H,(H,13,14)(H,15,16)/b4-3+
Reactome pathway
n/an/a 4.38E+6n/an/an/an/an/an/a
Acadia University
Curated by ChEMBL
Assay Description
Inhibition of human NMT expressed in Escherichia coli DH5alpha cells
Bioorg Med Chem Lett 20: 1510-5 (2010)
Article DOI: 10.1016/j.bmcl.2010.01.098
BindingDB Entry DOI: 10.7270/Q28P60NS