BDBM50313609 5'-Chloro-1H,1'H-[2,3']biindolylidene-3,2'-dione 3-oxime::CHEMBL511450
SMILES: Clc1ccc2NC(=O)C(c2c1)c1[nH]c2ccccc2c1N=O
InChI Key: InChIKey=NZRKBKXFVZAWCV-UHFFFAOYSA-N
Data: 1 IC50
Activity Spreadsheet -- Enzyme Inhibition Constant Data from BindingDB
Found 1 hit for monomerid = 50313609
Trg + Lig
Ki
nM
ΔG°
kcal/mole
IC50
nM
Kd
nM
EC50/IC50
nM
koff
s-1
kon
M-1s-1
pHTemp
°C
Receptor-type tyrosine-protein kinase FLT3
(Homo sapiens (Human))
BDBM50313609
(5'-Chloro-1H,1'H-[2,3']biindolylidene-3,2'-dione 3...)
Show SMILES Clc1ccc2NC(=O)C(c2c1)c1[nH]c2ccccc2c1N=O
Show InChI InChI=1S/C16H10ClN3O2/c17-8-5-6-12-10(7-8)13(16(21)19-12)15-14(20-22)9-3-1-2-4-11(9)18-15/h1-7,13,18H,(H,19,21)
n/an/a 82n/an/an/an/an/an/a
Institute of Science and Technology
Curated by ChEMBL
Assay Description
Inhibition of FLT3 by HTRF assay
Bioorg Med Chem Lett 20: 2033-7 (2010)
Article DOI: 10.1016/j.bmcl.2010.01.039
BindingDB Entry DOI: 10.7270/Q29W0GF0