BDBM50313615 CHEMBL1085922::Sodium-3,2'-dioxo-1,3,1',2'-tetrahydro-[2,3']biindolylidene-5'-sulfonate
SMILES: [O-]S(=O)(=O)c1ccc2NC(=O)\C(=C3/Nc4ccccc4C3=O)c2c1
InChI Key: InChIKey=IHBOEHLUIBMBMY-YPKPFQOOSA-M
Data: 1 IC50
Activity Spreadsheet -- Enzyme Inhibition Constant Data from BindingDB
Found 1 hit for monomerid = 50313615
Trg + Lig
Ki
nM
ΔG°
kcal/mole
IC50
nM
Kd
nM
EC50/IC50
nM
koff
s-1
kon
M-1s-1
pHTemp
°C
Receptor-type tyrosine-protein kinase FLT3
(Homo sapiens (Human))
BDBM50313615
(CHEMBL1085922 | Sodium-3,2'-dioxo-1,3,1',2'-tetrah...)
Show SMILES [O-]S(=O)(=O)c1ccc2NC(=O)\C(=C3/Nc4ccccc4C3=O)c2c1
Show InChI InChI=1S/C16H10N2O5S/c19-15-9-3-1-2-4-11(9)17-14(15)13-10-7-8(24(21,22)23)5-6-12(10)18-16(13)20/h1-7,17H,(H,18,20)(H,21,22,23)/p-1/b14-13-
n/an/a 280n/an/an/an/an/an/a
Institute of Science and Technology
Curated by ChEMBL
Assay Description
Inhibition of FLT3 by HTRF assay
Bioorg Med Chem Lett 20: 2033-7 (2010)
Article DOI: 10.1016/j.bmcl.2010.01.039
BindingDB Entry DOI: 10.7270/Q29W0GF0