null
SMILES: O=C(OCc1ccccc1)N(CCCCN1CCCCC1)CC#N
InChI Key: InChIKey=RICZASBPUMGABP-UHFFFAOYSA-N
Activity Spreadsheet -- Enzyme Inhibition Constant Data from BindingDB
Found 1 hit for monomerid = 50313768
Trg + Lig
Ki
nM
ΔG°
kcal/mole
IC50
nM
Kd
nM
EC50/IC50
nM
koff
s-1
kon
M-1s-1
pHTemp
°C
Metacaspase-2
(Trypanosoma brucei)
BDBM50313768
(CHEMBL1091473 | benzyl cyanomethyl(4-(piperidin-1-...)
Show SMILES O=C(OCc1ccccc1)N(CCCCN1CCCCC1)CC#N
Show InChI InChI=1S/C19H27N3O2/c20-11-16-22(15-8-7-14-21-12-5-2-6-13-21)19(23)24-17-18-9-3-1-4-10-18/h1,3-4,9-10H,2,5-8,12-17H2
n/an/a>1.00E+5n/an/an/an/an/an/a
University of Antwerp
Curated by ChEMBL
Assay Description
Inhibition of Trypanosoma brucei MAC2
Bioorg Med Chem Lett 20: 2001-6 (2010)
Article DOI: 10.1016/j.bmcl.2010.01.099
BindingDB Entry DOI: 10.7270/Q2BG2P5T