BDBM50313793 (S)-3-(3-amino-4-(3-(5,6,7,8-tetrahydro-1,8-naphthyridin-2-yl)propoxy)phenyl)-2-(3-(trifluoromethyl)phenylsulfonamido)propanoic acid::CHEMBL565693
SMILES: Nc1cc(C[C@H](NS(=O)(=O)c2cccc(c2)C(F)(F)F)C(O)=O)ccc1OCCCc1ccc2CCCNc2n1
InChI Key: InChIKey=LRJXQAWFNQBGLZ-QHCPKHFHSA-N
Data: 3 IC50
Activity Spreadsheet -- Enzyme Inhibition Constant Data from BindingDB
Found 3 hits for monomerid = 50313793
Trg + Lig
Ki
nM
ΔG°
kcal/mole
IC50
nM
Kd
nM
EC50/IC50
nM
koff
s-1
kon
M-1s-1
pHTemp
°C
ITGA5/ITGB1
(Homo sapiens (Human))
BDBM50313793
((S)-3-(3-amino-4-(3-(5,6,7,8-tetrahydro-1,8-naphth...)
Show SMILES Nc1cc(C[C@H](NS(=O)(=O)c2cccc(c2)C(F)(F)F)C(O)=O)ccc1OCCCc1ccc2CCCNc2n1 |r|
Show InChI InChI=1S/C27H29F3N4O5S/c28-27(29,30)19-5-1-7-21(16-19)40(37,38)34-23(26(35)36)15-17-8-11-24(22(31)14-17)39-13-3-6-20-10-9-18-4-2-12-32-25(18)33-20/h1,5,7-11,14,16,23,34H,2-4,6,12-13,15,31H2,(H,32,33)(H,35,36)/t23-/m0/s1
n/an/a 0.100n/an/an/an/an/an/a
Universit£ Catholique de Louvain
Curated by ChEMBL
Assay Description
Inhibition of human Integrin alpha5beta3 receptors expressed in HOP cells assessed as cell attachment after 30 mins by colorimetric assay
Bioorg Med Chem Lett 20: 1861-5 (2010)
Article DOI: 10.1016/j.bmcl.2010.01.150
BindingDB Entry DOI: 10.7270/Q2Z60P6B
ITGAV/ITGB3
(Homo sapiens (Human))
BDBM50313793
((S)-3-(3-amino-4-(3-(5,6,7,8-tetrahydro-1,8-naphth...)
Show SMILES Nc1cc(C[C@H](NS(=O)(=O)c2cccc(c2)C(F)(F)F)C(O)=O)ccc1OCCCc1ccc2CCCNc2n1 |r|
Show InChI InChI=1S/C27H29F3N4O5S/c28-27(29,30)19-5-1-7-21(16-19)40(37,38)34-23(26(35)36)15-17-8-11-24(22(31)14-17)39-13-3-6-20-10-9-18-4-2-12-32-25(18)33-20/h1,5,7-11,14,16,23,34H,2-4,6,12-13,15,31H2,(H,32,33)(H,35,36)/t23-/m0/s1
n/an/a 0.100n/an/an/an/an/an/a
Universite Catholique de Louvain
Curated by ChEMBL
Assay Description
Inhibition of human integrin alphav beta3 receptor by biotinylated vitronectin competitive binding assay
J Med Chem 52: 7029-43 (2009)
Article DOI: 10.1021/jm901133z
BindingDB Entry DOI: 10.7270/Q2GB2507
Integrin alpha-IIb/beta-3
(Homo sapiens (Human))
BDBM50313793
((S)-3-(3-amino-4-(3-(5,6,7,8-tetrahydro-1,8-naphth...)
Show SMILES Nc1cc(C[C@H](NS(=O)(=O)c2cccc(c2)C(F)(F)F)C(O)=O)ccc1OCCCc1ccc2CCCNc2n1 |r|
Show InChI InChI=1S/C27H29F3N4O5S/c28-27(29,30)19-5-1-7-21(16-19)40(37,38)34-23(26(35)36)15-17-8-11-24(22(31)14-17)39-13-3-6-20-10-9-18-4-2-12-32-25(18)33-20/h1,5,7-11,14,16,23,34H,2-4,6,12-13,15,31H2,(H,32,33)(H,35,36)/t23-/m0/s1
n/an/a 141n/an/an/an/an/an/a
Universite Catholique de Louvain
Curated by ChEMBL
Assay Description
Inhibition of human integrin alpha2b beta3 receptor by fibrinogen competitive binding assay
J Med Chem 52: 7029-43 (2009)
Article DOI: 10.1021/jm901133z
BindingDB Entry DOI: 10.7270/Q2GB2507