BDBM50313794 (S)-3-(3-(20-amino-3,6,9,12,15,18-hexaoxaicosanamido)-4-(3-(5,6,7,8-tetrahydro-1,8-naphthyridin-2-yl)propoxy)phenyl)-2-(3-(trifluoromethyl)phenylsulfonamido)propanoic acid::CHEMBL1077191
SMILES: NCCOCCOCCOCCOCCOCCOCC(=O)Nc1cc(C[C@H](NS(=O)(=O)c2cccc(c2)C(F)(F)F)C(O)=O)ccc1OCCCc1ccc2CCCNc2n1
InChI Key: InChIKey=UDGWKAUBGPXUNT-BHVANESWSA-N
Data: 1 IC50
Activity Spreadsheet -- Enzyme Inhibition Constant Data from BindingDB
Found 1 hit for monomerid = 50313794
Trg + Lig
Ki
nM
ΔG°
kcal/mole
IC50
nM
Kd
nM
EC50/IC50
nM
koff
s-1
kon
M-1s-1
pHTemp
°C
ITGA5/ITGB1
(Homo sapiens (Human))
BDBM50313794
((S)-3-(3-(20-amino-3,6,9,12,15,18-hexaoxaicosanami...)
Show SMILES NCCOCCOCCOCCOCCOCCOCC(=O)Nc1cc(C[C@H](NS(=O)(=O)c2cccc(c2)C(F)(F)F)C(O)=O)ccc1OCCCc1ccc2CCCNc2n1 |r|
Show InChI InChI=1S/C41H56F3N5O12S/c42-41(43,44)32-5-1-7-34(28-32)62(53,54)49-36(40(51)52)27-30-8-11-37(61-14-3-6-33-10-9-31-4-2-13-46-39(31)47-33)35(26-30)48-38(50)29-60-25-24-59-23-22-58-21-20-57-19-18-56-17-16-55-15-12-45/h1,5,7-11,26,28,36,49H,2-4,6,12-25,27,29,45H2,(H,46,47)(H,48,50)(H,51,52)/t36-/m0/s1
n/an/a 0.700n/an/an/an/an/an/a
Universit£ Catholique de Louvain
Curated by ChEMBL
Assay Description
Inhibition of human Integrin alpha5beta3 receptors expressed in HOP cells assessed as cell attachment after 30 mins by colorimetric assay
Bioorg Med Chem Lett 20: 1861-5 (2010)
Article DOI: 10.1016/j.bmcl.2010.01.150
BindingDB Entry DOI: 10.7270/Q2Z60P6B