BDBM50313800 (1R,3S)-3-(2-acetamidopropan-2-yl)-N-((2S,3S,5R)-6-(butylamino)-3-hydroxy-5-methyl-6-oxo-1-phenylhexan-2-yl)cyclohexanecarboxamide::(1R,3S)-3-[1-(acetylamino)-1-methylethyl]-N-[(1S,2S,4R)-1-benzyl-5-(butylamino)-2-hydroxy-4-methyl-5-oxopentyl]cyclohexanecarboxamide::CHEMBL1093388
SMILES: CCCCNC(=O)[C@H](C)C[C@H](O)[C@H](Cc1ccccc1)NC(=O)[C@@H]1CCC[C@@H](C1)C(C)(C)NC(C)=O
InChI Key: InChIKey=NGUMIHCAWWHVPZ-MTKOPPBXSA-N
Data: 3 IC50
PDB links: 1 PDB ID matches this monomer.
Activity Spreadsheet -- Enzyme Inhibition Constant Data from BindingDB
Found 3 hits for monomerid = 50313800
Trg + Lig
Ki
nM
ΔG°
kcal/mole
IC50
nM
Kd
nM
EC50/IC50
nM
koff
s-1
kon
M-1s-1
pHTemp
°C
Beta-secretase 1
(Homo sapiens (Human))
BDBM50313800
((1R,3S)-3-(2-acetamidopropan-2-yl)-N-((2S,3S,5R)-6...)
Show SMILES CCCCNC(=O)[C@H](C)C[C@H](O)[C@H](Cc1ccccc1)NC(=O)[C@@H]1CCC[C@@H](C1)C(C)(C)NC(C)=O |r|
Show InChI InChI=1S/C29H47N3O4/c1-6-7-16-30-27(35)20(2)17-26(34)25(18-22-12-9-8-10-13-22)31-28(36)23-14-11-15-24(19-23)29(4,5)32-21(3)33/h8-10,12-13,20,23-26,34H,6-7,11,14-19H2,1-5H3,(H,30,35)(H,31,36)(H,32,33)/t20-,23-,24+,25+,26+/m1/s1
n/an/a 3.70E+3n/an/an/an/an/an/a
Universit£ de Montr£al
Curated by ChEMBL
Assay Description
Inhibition of BACE1
Bioorg Med Chem Lett 20: 1924-7 (2010)
Article DOI: 10.1016/j.bmcl.2010.01.139
BindingDB Entry DOI: 10.7270/Q2TD9XHH
3D
3D Structure (crystal)
Beta-secretase 2
(Homo sapiens (Human))
BDBM50313800
((1R,3S)-3-(2-acetamidopropan-2-yl)-N-((2S,3S,5R)-6...)
Show SMILES CCCCNC(=O)[C@H](C)C[C@H](O)[C@H](Cc1ccccc1)NC(=O)[C@@H]1CCC[C@@H](C1)C(C)(C)NC(C)=O |r|
Show InChI InChI=1S/C29H47N3O4/c1-6-7-16-30-27(35)20(2)17-26(34)25(18-22-12-9-8-10-13-22)31-28(36)23-14-11-15-24(19-23)29(4,5)32-21(3)33/h8-10,12-13,20,23-26,34H,6-7,11,14-19H2,1-5H3,(H,30,35)(H,31,36)(H,32,33)/t20-,23-,24+,25+,26+/m1/s1
n/an/a 370n/an/an/an/an/an/a
Universit£ de Montr£al
Curated by ChEMBL
Assay Description
Inhibition of BACE2
Bioorg Med Chem Lett 20: 1924-7 (2010)
Article DOI: 10.1016/j.bmcl.2010.01.139
BindingDB Entry DOI: 10.7270/Q2TD9XHH
Cathepsin D
(Homo sapiens (Human))
BDBM50313800
((1R,3S)-3-(2-acetamidopropan-2-yl)-N-((2S,3S,5R)-6...)
Show SMILES CCCCNC(=O)[C@H](C)C[C@H](O)[C@H](Cc1ccccc1)NC(=O)[C@@H]1CCC[C@@H](C1)C(C)(C)NC(C)=O |r|
Show InChI InChI=1S/C29H47N3O4/c1-6-7-16-30-27(35)20(2)17-26(34)25(18-22-12-9-8-10-13-22)31-28(36)23-14-11-15-24(19-23)29(4,5)32-21(3)33/h8-10,12-13,20,23-26,34H,6-7,11,14-19H2,1-5H3,(H,30,35)(H,31,36)(H,32,33)/t20-,23-,24+,25+,26+/m1/s1
NCI pathway
Reactome pathway
n/an/a 240n/an/an/an/an/an/a
Universit£ de Montr£al
Curated by ChEMBL
Assay Description
Inhibition of Cathepsin D
Bioorg Med Chem Lett 20: 1924-7 (2010)
Article DOI: 10.1016/j.bmcl.2010.01.139
BindingDB Entry DOI: 10.7270/Q2TD9XHH