null
SMILES: C[C@@H](NC(=O)c1cc(cc(c1)-c1noc(n1)[C@](C)(N)Cc1ccccc1)N(C)S(C)(=O)=O)c1ccc(F)cc1
InChI Key: InChIKey=IFSSCWNNZXMEGN-KWMCUTETSA-N
Activity Spreadsheet -- Enzyme Inhibition Constant Data from BindingDB
Found 1 hit for monomerid = 50313910
Trg + Lig
Ki
nM
ΔG°
kcal/mole
IC50
nM
Kd
nM
EC50/IC50
nM
koff
s-1
kon
M-1s-1
pHTemp
°C
Beta-secretase 1
(Homo sapiens (Human))
BDBM50313910
(3-(5-((R)-2-amino-1-phenylpropan-2-yl)-1,2,4-oxadi...)
Show SMILES C[C@@H](NC(=O)c1cc(cc(c1)-c1noc(n1)[C@](C)(N)Cc1ccccc1)N(C)S(C)(=O)=O)c1ccc(F)cc1 |r|
Show InChI InChI=1S/C28H30FN5O4S/c1-18(20-10-12-23(29)13-11-20)31-26(35)22-14-21(15-24(16-22)34(3)39(4,36)37)25-32-27(38-33-25)28(2,30)17-19-8-6-5-7-9-19/h5-16,18H,17,30H2,1-4H3,(H,31,35)/t18-,28-/m1/s1
n/an/a 2.06E+3n/an/an/an/an/an/a
Merck Research Laboratories
Curated by ChEMBL
Assay Description
Inhibition of BACE1
Bioorg Med Chem Lett 20: 1885-9 (2010)
Article DOI: 10.1016/j.bmcl.2010.01.137
BindingDB Entry DOI: 10.7270/Q21Z44JX