BDBM50314054 CHEMBL1093104::N-(3-(2-(4-methylpiperazin-1-yl)pyrazolo[1,5-a]pyrimidin-7-yl)phenyl)-3-(trifluoromethyl)benzamide
SMILES: CN1CCN(CC1)c1cc2nccc(-c3cccc(NC(=O)c4cccc(c4)C(F)(F)F)c3)n2n1
InChI Key: InChIKey=IVFOMDILWVRNQN-UHFFFAOYSA-N
Data: 1 IC50
Activity Spreadsheet -- Enzyme Inhibition Constant Data from BindingDB
Found 1 hit for monomerid = 50314054
Trg + Lig
Ki
nM
ΔG°
kcal/mole
IC50
nM
Kd
nM
EC50/IC50
nM
koff
s-1
kon
M-1s-1
pHTemp
°C
Serine/threonine-protein kinase B-raf
(Homo sapiens (Human))
BDBM50314054
(CHEMBL1093104 | N-(3-(2-(4-methylpiperazin-1-yl)py...)
Show SMILES CN1CCN(CC1)c1cc2nccc(-c3cccc(NC(=O)c4cccc(c4)C(F)(F)F)c3)n2n1
Show InChI InChI=1S/C25H23F3N6O/c1-32-10-12-33(13-11-32)23-16-22-29-9-8-21(34(22)31-23)17-4-3-7-20(15-17)30-24(35)18-5-2-6-19(14-18)25(26,27)28/h2-9,14-16H,10-13H2,1H3,(H,30,35)
NCI pathway
Reactome pathway
n/an/a>1.00E+4n/an/an/an/an/an/a
Wyeth Research
Curated by ChEMBL
Assay Description
Inhibition of b-Raf
Bioorg Med Chem Lett 19: 6890-2 (2009)
Article DOI: 10.1016/j.bmcl.2009.10.074
BindingDB Entry DOI: 10.7270/Q2C829F3