null
SMILES: Cc1cc(NC(=O)Nc2ncc(CCNc3cc(Nc4nnc[nH]4)ncn3)s2)c(o1)C(F)(F)F
InChI Key: InChIKey=KNTGXMNWVXZIMW-UHFFFAOYSA-N
Activity Spreadsheet -- Enzyme Inhibition Constant Data from BindingDB
Found 1 hit for monomerid = 50314075
Trg + Lig
Ki
nM
ΔG°
kcal/mole
IC50
nM
Kd
nM
EC50/IC50
nM
koff
s-1
kon
M-1s-1
pHTemp
°C
Serine/threonine-protein kinase PLK1
(Homo sapiens (Human))
BDBM50314075
(1-(5-(2-(6-(1H-1,2,4-triazol-3-ylamino)pyrimidin-4...)
Show SMILES Cc1cc(NC(=O)Nc2ncc(CCNc3cc(Nc4nnc[nH]4)ncn3)s2)c(o1)C(F)(F)F
Show InChI InChI=1S/C18H17F3N10O2S/c1-9-4-11(14(33-9)18(19,20)21)28-16(32)30-17-23-6-10(34-17)2-3-22-12-5-13(25-7-24-12)29-15-26-8-27-31-15/h4-8H,2-3H2,1H3,(H2,23,28,30,32)(H3,22,24,25,26,27,29,31)
NCI pathway
Reactome pathway
n/an/a 720n/an/an/an/an/an/a
Nerviano Medical Sciences
Curated by ChEMBL
Assay Description
Inhibition of PLK1
J Med Chem 53: 2681-94 (2010)
Article DOI: 10.1021/jm901443h
BindingDB Entry DOI: 10.7270/Q2XP75W8