BDBM50314113 1-(3-amino-6-(2-chlorophenyl)-5-(4-chlorophenyl)furo[2,3-b]pyridin-2-yl)-2-methylpropan-1-one::CHEMBL1091692
SMILES: CC(C)C(=O)c1oc2nc(-c3ccccc3Cl)c(cc2c1N)-c1ccc(Cl)cc1
InChI Key: InChIKey=DMOWIFGXQZDDEZ-UHFFFAOYSA-N
Data: 2 IC50
Activity Spreadsheet -- Enzyme Inhibition Constant Data from BindingDB
Found 2 hits for monomerid = 50314113
Trg + Lig
Ki
nM
ΔG°
kcal/mole
IC50
nM
Kd
nM
EC50/IC50
nM
koff
s-1
kon
M-1s-1
pHTemp
°C
Cannabinoid receptor 2
(Homo sapiens (Human))
BDBM50314113
(1-(3-amino-6-(2-chlorophenyl)-5-(4-chlorophenyl)fu...)
Show SMILES CC(C)C(=O)c1oc2nc(-c3ccccc3Cl)c(cc2c1N)-c1ccc(Cl)cc1
Show InChI InChI=1S/C23H18Cl2N2O2/c1-12(2)21(28)22-19(26)17-11-16(13-7-9-14(24)10-8-13)20(27-23(17)29-22)15-5-3-4-6-18(15)25/h3-12H,26H2,1-2H3
Reactome pathway
n/an/a 1.30E+3n/an/an/an/an/an/a
Merck Research Laboratories
Curated by ChEMBL
Assay Description
Inhibition of human CB2 receptor
Bioorg Med Chem Lett 20: 1448-52 (2010)
Article DOI: 10.1016/j.bmcl.2009.12.065
BindingDB Entry DOI: 10.7270/Q2028RPD
Cannabinoid receptor 1
(Homo sapiens (Human))
BDBM50314113
(1-(3-amino-6-(2-chlorophenyl)-5-(4-chlorophenyl)fu...)
Show SMILES CC(C)C(=O)c1oc2nc(-c3ccccc3Cl)c(cc2c1N)-c1ccc(Cl)cc1
Show InChI InChI=1S/C23H18Cl2N2O2/c1-12(2)21(28)22-19(26)17-11-16(13-7-9-14(24)10-8-13)20(27-23(17)29-22)15-5-3-4-6-18(15)25/h3-12H,26H2,1-2H3
NCI pathway
Reactome pathway
n/an/a 1.70n/an/an/an/an/an/a
Merck Research Laboratories
Curated by ChEMBL
Assay Description
Inhibition of human CB1 receptor
Bioorg Med Chem Lett 20: 1448-52 (2010)
Article DOI: 10.1016/j.bmcl.2009.12.065
BindingDB Entry DOI: 10.7270/Q2028RPD