BDBM50314282 (-)-(R)-2-(3-(1-(3-fluoropyridin-2-yl)ethyl)benzo[b]thiophen-2-yl)-N,N-dimethylethanamine::CHEMBL1092377
SMILES: C[C@H](c1c(CCN(C)C)sc2ccccc12)c1ncccc1F
InChI Key: InChIKey=GETROLYXSDDSDH-CYBMUJFWSA-N
Data: 3 KI  3 IC50
Activity Spreadsheet -- Enzyme Inhibition Constant Data from BindingDB
Found 6 hits for monomerid = 50314282
Trg + Lig
Ki
nM
ΔG°
kcal/mole
IC50
nM
Kd
nM
EC50/IC50
nM
koff
s-1
kon
M-1s-1
pHTemp
°C
Histamine H1 receptor
(Homo sapiens (Human))
BDBM50314282
((-)-(R)-2-(3-(1-(3-fluoropyridin-2-yl)ethyl)benzo[...)
Show SMILES C[C@H](c1c(CCN(C)C)sc2ccccc12)c1ncccc1F |r|
Show InChI InChI=1S/C19H21FN2S/c1-13(19-15(20)8-6-11-21-19)18-14-7-4-5-9-16(14)23-17(18)10-12-22(2)3/h4-9,11,13H,10,12H2,1-3H3/t13-/m1/s1
Reactome pathway
2.70n/an/an/an/an/an/an/an/a
Neurocrine Biosciences
Curated by ChEMBL
Assay Description
Displacement of [3H]pyrilamine from human histamine H1 receptor expressed in CHO Flp-In cells after 90 mins by scintillation counting
Bioorg Med Chem Lett 20: 2316-20 (2010)
Article DOI: 10.1016/j.bmcl.2010.01.134
BindingDB Entry DOI: 10.7270/Q2P55PG0
Muscarinic acetylcholine receptor M1
(Homo sapiens (Human))
BDBM50314282
((-)-(R)-2-(3-(1-(3-fluoropyridin-2-yl)ethyl)benzo[...)
Show SMILES C[C@H](c1c(CCN(C)C)sc2ccccc12)c1ncccc1F |r|
Show InChI InChI=1S/C19H21FN2S/c1-13(19-15(20)8-6-11-21-19)18-14-7-4-5-9-16(14)23-17(18)10-12-22(2)3/h4-9,11,13H,10,12H2,1-3H3/t13-/m1/s1
2.20E+3n/an/an/an/an/an/an/an/a
Neurocrine Biosciences
Curated by ChEMBL
Assay Description
Displacement of [3H]N-methylscopolamine from human muscarinic M1 receptor expressed in CHO Flp-In cells after 90 mins by scintillation counting
Bioorg Med Chem Lett 20: 2316-20 (2010)
Article DOI: 10.1016/j.bmcl.2010.01.134
BindingDB Entry DOI: 10.7270/Q2P55PG0
Potassium voltage-gated channel subfamily H member 2
(Homo sapiens (Human))
BDBM50314282
((-)-(R)-2-(3-(1-(3-fluoropyridin-2-yl)ethyl)benzo[...)
Show SMILES C[C@H](c1c(CCN(C)C)sc2ccccc12)c1ncccc1F |r|
Show InChI InChI=1S/C19H21FN2S/c1-13(19-15(20)8-6-11-21-19)18-14-7-4-5-9-16(14)23-17(18)10-12-22(2)3/h4-9,11,13H,10,12H2,1-3H3/t13-/m1/s1
Reactome pathway
>5.00E+3n/an/an/an/an/an/an/an/a
Neurocrine Biosciences
Curated by ChEMBL
Assay Description
Displacement of [3H]Dofetilide from human ERG
Bioorg Med Chem Lett 20: 2316-20 (2010)
Article DOI: 10.1016/j.bmcl.2010.01.134
BindingDB Entry DOI: 10.7270/Q2P55PG0
Cytochrome P450 3A4
(Homo sapiens (Human))
BDBM50314282
((-)-(R)-2-(3-(1-(3-fluoropyridin-2-yl)ethyl)benzo[...)
Show SMILES C[C@H](c1c(CCN(C)C)sc2ccccc12)c1ncccc1F |r|
Show InChI InChI=1S/C19H21FN2S/c1-13(19-15(20)8-6-11-21-19)18-14-7-4-5-9-16(14)23-17(18)10-12-22(2)3/h4-9,11,13H,10,12H2,1-3H3/t13-/m1/s1
Reactome pathway
n/an/a>1.00E+4n/an/an/an/an/an/a
Neurocrine Biosciences
Curated by ChEMBL
Assay Description
Inhibition of recombinant CYP3A4 after 30 mins by fluorescence assay
Bioorg Med Chem Lett 20: 2316-20 (2010)
Article DOI: 10.1016/j.bmcl.2010.01.134
BindingDB Entry DOI: 10.7270/Q2P55PG0
Potassium voltage-gated channel subfamily H member 2
(Homo sapiens (Human))
BDBM50314282
((-)-(R)-2-(3-(1-(3-fluoropyridin-2-yl)ethyl)benzo[...)
Show SMILES C[C@H](c1c(CCN(C)C)sc2ccccc12)c1ncccc1F |r|
Show InChI InChI=1S/C19H21FN2S/c1-13(19-15(20)8-6-11-21-19)18-14-7-4-5-9-16(14)23-17(18)10-12-22(2)3/h4-9,11,13H,10,12H2,1-3H3/t13-/m1/s1
Reactome pathway
n/an/a 330n/an/an/an/an/an/a
Neurocrine Biosciences
Curated by ChEMBL
Assay Description
Inhibition of human ERG expressed in HEK cells assessed as blockade of potassium tail current by standard patch clamp analysis
Bioorg Med Chem Lett 20: 2316-20 (2010)
Article DOI: 10.1016/j.bmcl.2010.01.134
BindingDB Entry DOI: 10.7270/Q2P55PG0
Cytochrome P450 2D6
(Homo sapiens (Human))
BDBM50314282
((-)-(R)-2-(3-(1-(3-fluoropyridin-2-yl)ethyl)benzo[...)
Show SMILES C[C@H](c1c(CCN(C)C)sc2ccccc12)c1ncccc1F |r|
Show InChI InChI=1S/C19H21FN2S/c1-13(19-15(20)8-6-11-21-19)18-14-7-4-5-9-16(14)23-17(18)10-12-22(2)3/h4-9,11,13H,10,12H2,1-3H3/t13-/m1/s1
n/an/a 4.00E+3n/an/an/an/an/an/a
Neurocrine Biosciences
Curated by ChEMBL
Assay Description
Inhibition of recombinant CYP2D6 after 30 mins by fluorescence assay
Bioorg Med Chem Lett 20: 2316-20 (2010)
Article DOI: 10.1016/j.bmcl.2010.01.134
BindingDB Entry DOI: 10.7270/Q2P55PG0