BDBM50314294 1-(4-bromophenyl)-1-(1-cyclopentylpiperidin-4-yl)-3-(4-fluorobenzyl)urea::CHEMBL1094030
SMILES: Fc1ccc(CNC(=O)N(C2CCN(CC2)C2CCCC2)c2ccc(Br)cc2)cc1
InChI Key: InChIKey=WHBCDNPPOUFKAB-UHFFFAOYSA-N
Data: 2 KI  2 IC50
Activity Spreadsheet -- Enzyme Inhibition Constant Data from BindingDB
Found 4 hits for monomerid = 50314294
Trg + Lig
Ki
nM
ΔG°
kcal/mole
IC50
nM
Kd
nM
EC50/IC50
nM
koff
s-1
kon
M-1s-1
pHTemp
°C
Histamine H3 receptor
(Homo sapiens (Human))
BDBM50314294
(1-(4-bromophenyl)-1-(1-cyclopentylpiperidin-4-yl)-...)
Show SMILES Fc1ccc(CNC(=O)N(C2CCN(CC2)C2CCCC2)c2ccc(Br)cc2)cc1
Show InChI InChI=1S/C24H29BrFN3O/c25-19-7-11-22(12-8-19)29(24(30)27-17-18-5-9-20(26)10-6-18)23-13-15-28(16-14-23)21-3-1-2-4-21/h5-12,21,23H,1-4,13-17H2,(H,27,30)
Reactome pathway
7n/an/an/an/an/an/an/an/a
Merck Research Laboratories
Curated by ChEMBL
Assay Description
Antagonist activity at human recombinant histamine 3 receptor
Bioorg Med Chem Lett 20: 2359-64 (2010)
Article DOI: 10.1016/j.bmcl.2010.01.121
BindingDB Entry DOI: 10.7270/Q2Z31ZSM
Histamine H3 receptor
(Homo sapiens (Human))
BDBM50314294
(1-(4-bromophenyl)-1-(1-cyclopentylpiperidin-4-yl)-...)
Show SMILES Fc1ccc(CNC(=O)N(C2CCN(CC2)C2CCCC2)c2ccc(Br)cc2)cc1
Show InChI InChI=1S/C24H29BrFN3O/c25-19-7-11-22(12-8-19)29(24(30)27-17-18-5-9-20(26)10-6-18)23-13-15-28(16-14-23)21-3-1-2-4-21/h5-12,21,23H,1-4,13-17H2,(H,27,30)
Reactome pathway
7n/an/an/an/an/an/an/an/a
Bioprojet-Biotech
Curated by ChEMBL
Assay Description
Displacement of [125I]Iodoproxyfan from human recombinant histamine H3 receptor by Competitive binding assay
Bioorg Med Chem Lett 21: 5378-83 (2011)
Article DOI: 10.1016/j.bmcl.2011.07.006
BindingDB Entry DOI: 10.7270/Q2VX0GXK
Potassium voltage-gated channel subfamily H member 2
(Homo sapiens (Human))
BDBM50314294
(1-(4-bromophenyl)-1-(1-cyclopentylpiperidin-4-yl)-...)
Show SMILES Fc1ccc(CNC(=O)N(C2CCN(CC2)C2CCCC2)c2ccc(Br)cc2)cc1
Show InChI InChI=1S/C24H29BrFN3O/c25-19-7-11-22(12-8-19)29(24(30)27-17-18-5-9-20(26)10-6-18)23-13-15-28(16-14-23)21-3-1-2-4-21/h5-12,21,23H,1-4,13-17H2,(H,27,30)
Reactome pathway
n/an/a 202n/an/an/an/an/an/a
Bioprojet-Biotech
Curated by ChEMBL
Assay Description
Displacement of [3H]dofetilide from human recombinant ERG by Competitive binding assay
Bioorg Med Chem Lett 21: 5378-83 (2011)
Article DOI: 10.1016/j.bmcl.2011.07.006
BindingDB Entry DOI: 10.7270/Q2VX0GXK
Potassium voltage-gated channel subfamily H member 2
(Homo sapiens (Human))
BDBM50314294
(1-(4-bromophenyl)-1-(1-cyclopentylpiperidin-4-yl)-...)
Show SMILES Fc1ccc(CNC(=O)N(C2CCN(CC2)C2CCCC2)c2ccc(Br)cc2)cc1
Show InChI InChI=1S/C24H29BrFN3O/c25-19-7-11-22(12-8-19)29(24(30)27-17-18-5-9-20(26)10-6-18)23-13-15-28(16-14-23)21-3-1-2-4-21/h5-12,21,23H,1-4,13-17H2,(H,27,30)
Reactome pathway
n/an/a 202n/an/an/an/an/an/a
Merck Research Laboratories
Curated by ChEMBL
Assay Description
Inhibition of human ERG by ion works assay
Bioorg Med Chem Lett 20: 2359-64 (2010)
Article DOI: 10.1016/j.bmcl.2010.01.121
BindingDB Entry DOI: 10.7270/Q2Z31ZSM