BDBM50314371 (1S,2R)-2-((R)-1-(3,5-bis(trifluoromethyl)phenyl)ethoxy)-1-(4-fluorophenyl)-2,3,8,8a-tetrahydroindolizin-5(1H)-one::CHEMBL1092755
SMILES: C[C@@H](O[C@H]1CN2C(CC=CC2=O)[C@@H]1c1ccc(F)cc1)c1cc(cc(c1)C(F)(F)F)C(F)(F)F
InChI Key: InChIKey=MIUIONPWXDNWET-RMXHKDRNSA-N
Data: 2 IC50
Activity Spreadsheet -- Enzyme Inhibition Constant Data from BindingDB
Found 2 hits for monomerid = 50314371
Trg + Lig
Ki
nM
ΔG°
kcal/mole
IC50
nM
Kd
nM
EC50/IC50
nM
koff
s-1
kon
M-1s-1
pHTemp
°C
Neurokinin 1 receptor
(Homo sapiens (Human))
BDBM50314371
((1S,2R)-2-((R)-1-(3,5-bis(trifluoromethyl)phenyl)e...)
Show SMILES C[C@@H](O[C@H]1CN2C(CC=CC2=O)[C@@H]1c1ccc(F)cc1)c1cc(cc(c1)C(F)(F)F)C(F)(F)F |r,c:8|
Show InChI InChI=1S/C24H20F7NO2/c1-13(15-9-16(23(26,27)28)11-17(10-15)24(29,30)31)34-20-12-32-19(3-2-4-21(32)33)22(20)14-5-7-18(25)8-6-14/h2,4-11,13,19-20,22H,3,12H2,1H3/t13-,19?,20+,22+/m1/s1
Reactome pathway
n/an/a 0.530n/an/an/an/an/an/a
Merck Research Laboratories
Curated by ChEMBL
Assay Description
Displacement of [125I]substance P from human NK1 receptor expressed in CHO cells in presence of 50% human serum
Bioorg Med Chem Lett 20: 2354-8 (2010)
Article DOI: 10.1016/j.bmcl.2010.01.120
BindingDB Entry DOI: 10.7270/Q2JD4XR8
Neurokinin 1 receptor
(Homo sapiens (Human))
BDBM50314371
((1S,2R)-2-((R)-1-(3,5-bis(trifluoromethyl)phenyl)e...)
Show SMILES C[C@@H](O[C@H]1CN2C(CC=CC2=O)[C@@H]1c1ccc(F)cc1)c1cc(cc(c1)C(F)(F)F)C(F)(F)F |r,c:8|
Show InChI InChI=1S/C24H20F7NO2/c1-13(15-9-16(23(26,27)28)11-17(10-15)24(29,30)31)34-20-12-32-19(3-2-4-21(32)33)22(20)14-5-7-18(25)8-6-14/h2,4-11,13,19-20,22H,3,12H2,1H3/t13-,19?,20+,22+/m1/s1
Reactome pathway
n/an/a 0.0130n/an/an/an/an/an/a
Merck Research Laboratories
Curated by ChEMBL
Assay Description
Displacement of [125I]substance P from human NK1 receptor expressed in CHO cells
Bioorg Med Chem Lett 20: 2354-8 (2010)
Article DOI: 10.1016/j.bmcl.2010.01.120
BindingDB Entry DOI: 10.7270/Q2JD4XR8