BDBM50314423 3-amino-4-(furan-3-yl)-5,6,7,8,9,10-hexahydrocycloocta[b]thieno[3,2-e]pyridine-2-carboxamide::CHEMBL1089331
SMILES: NC(=O)c1sc2nc3CCCCCCc3c(-c3ccoc3)c2c1N
InChI Key: InChIKey=ZQCKXIWNXAGQNH-UHFFFAOYSA-N
Data: 1 IC50
Activity Spreadsheet -- Enzyme Inhibition Constant Data from BindingDB
Found 1 hit for monomerid = 50314423
Trg + Lig
Ki
nM
ΔG°
kcal/mole
IC50
nM
Kd
nM
EC50/IC50
nM
koff
s-1
kon
M-1s-1
pHTemp
°C
Eukaryotic elongation factor 2 kinase
(Homo sapiens (Human))
BDBM50314423
(3-amino-4-(furan-3-yl)-5,6,7,8,9,10-hexahydrocyclo...)
Show SMILES NC(=O)c1sc2nc3CCCCCCc3c(-c3ccoc3)c2c1N
Show InChI InChI=1S/C18H19N3O2S/c19-15-14-13(10-7-8-23-9-10)11-5-3-1-2-4-6-12(11)21-18(14)24-16(15)17(20)22/h7-9H,1-6,19H2,(H2,20,22)
Reactome pathway
n/an/a 1.10E+3n/an/an/an/an/an/a
Myriad Pharmaceuticals
Curated by ChEMBL
Assay Description
Inhibition of GST tagged eEf2K expressed in Escherichia coli by fluorometric method
Bioorg Med Chem Lett 20: 2283-6 (2010)
Article DOI: 10.1016/j.bmcl.2010.02.005
BindingDB Entry DOI: 10.7270/Q2F18ZVT