BDBM50314627 (E)-N-Hydroxy-3-{4-[3-(2-methyl-1H-indol-3-yl)piperidin-1-ylmethyl]-phenyl}acrylamide::CHEMBL1089343
SMILES: Cc1[nH]c2ccccc2c1C1CCCN(Cc2ccc(\C=C\C(=O)NO)cc2)C1
InChI Key: InChIKey=SDBLMAGBFSJKHB-OUKQBFOZSA-N
Data: 3 IC50
Activity Spreadsheet -- Enzyme Inhibition Constant Data from BindingDB
Found 3 hits for monomerid = 50314627
Trg + Lig
Ki
nM
ΔG°
kcal/mole
IC50
nM
Kd
nM
EC50/IC50
nM
koff
s-1
kon
M-1s-1
pHTemp
°C
Potassium voltage-gated channel subfamily H member 2
(Homo sapiens (Human))
BDBM50314627
((E)-N-Hydroxy-3-{4-[3-(2-methyl-1H-indol-3-yl)pipe...)
Show SMILES Cc1[nH]c2ccccc2c1C1CCCN(Cc2ccc(\C=C\C(=O)NO)cc2)C1
Show InChI InChI=1S/C24H27N3O2/c1-17-24(21-6-2-3-7-22(21)25-17)20-5-4-14-27(16-20)15-19-10-8-18(9-11-19)12-13-23(28)26-29/h2-3,6-13,20,25,29H,4-5,14-16H2,1H3,(H,26,28)/b13-12+
Reactome pathway
n/an/a 2.76E+4n/an/an/an/an/an/a
Novartis Institutes for Biomedical Research
Curated by ChEMBL
Assay Description
Inhibition of human ERG expressed in CHO cells by automated patch clamp electrophisiology assay
J Med Chem 53: 2952-63 (2010)
Article DOI: 10.1021/jm100007m
BindingDB Entry DOI: 10.7270/Q20V8CZC
Cereblon/Histone deacetylase 1
(Homo sapiens (Human))
BDBM50314627
((E)-N-Hydroxy-3-{4-[3-(2-methyl-1H-indol-3-yl)pipe...)
Show SMILES Cc1[nH]c2ccccc2c1C1CCCN(Cc2ccc(\C=C\C(=O)NO)cc2)C1
Show InChI InChI=1S/C24H27N3O2/c1-17-24(21-6-2-3-7-22(21)25-17)20-5-4-14-27(16-20)15-19-10-8-18(9-11-19)12-13-23(28)26-29/h2-3,6-13,20,25,29H,4-5,14-16H2,1H3,(H,26,28)/b13-12+
NCI pathway
Reactome pathway
n/an/a 6n/an/an/an/an/an/a
Indian CSIR-Central Drug Research Institute
Curated by ChEMBL
Assay Description
Inhibition of GST-tagged HDAC1 (unknown origin) expressed in insect cells using poly (Glu, Tyr) 4:1 as substrate measured after 15 mins in presence o...
Eur J Med Chem 158: 620-706 (2018)
Article DOI: 10.1016/j.ejmech.2018.08.073
Histone deacetylase 1
(Homo sapiens (Human))
BDBM50314627
((E)-N-Hydroxy-3-{4-[3-(2-methyl-1H-indol-3-yl)pipe...)
Show SMILES Cc1[nH]c2ccccc2c1C1CCCN(Cc2ccc(\C=C\C(=O)NO)cc2)C1
Show InChI InChI=1S/C24H27N3O2/c1-17-24(21-6-2-3-7-22(21)25-17)20-5-4-14-27(16-20)15-19-10-8-18(9-11-19)12-13-23(28)26-29/h2-3,6-13,20,25,29H,4-5,14-16H2,1H3,(H,26,28)/b13-12+
NCI pathway
Reactome pathway
n/an/a 5n/an/an/an/an/an/a
Novartis Institutes for Biomedical Research
Curated by ChEMBL
Assay Description
Inhibition of FLAG-tagged HDAC1 expressed in HEK293 cells by fluorescent assay
J Med Chem 53: 2952-63 (2010)
Article DOI: 10.1021/jm100007m
BindingDB Entry DOI: 10.7270/Q20V8CZC