BDBM50314643 (E)-3-{4-[(S)-3-(2-tert-Butyl-1H-indol-3-yl)piperidin-1-ylmethyl]-3-fluorophenyl}-N-hydroxyacrylamide::CHEMBL1093335
SMILES: CC(C)(C)c1[nH]c2ccccc2c1[C@@H]1CCCN(Cc2ccc(\C=C\C(=O)NO)cc2F)C1
InChI Key: InChIKey=ILQPFWGPYWQTHJ-VSFZPWCASA-N
Data: 6 IC50
Activity Spreadsheet -- Enzyme Inhibition Constant Data from BindingDB
Found 6 hits for monomerid = 50314643
Trg + Lig
Ki
nM
ΔG°
kcal/mole
IC50
nM
Kd
nM
EC50/IC50
nM
koff
s-1
kon
M-1s-1
pHTemp
°C
Histone deacetylase 2
(Homo sapiens (Human))
BDBM50314643
((E)-3-{4-[(S)-3-(2-tert-Butyl-1H-indol-3-yl)piperi...)
Show SMILES CC(C)(C)c1[nH]c2ccccc2c1[C@@H]1CCCN(Cc2ccc(\C=C\C(=O)NO)cc2F)C1 |r|
Show InChI InChI=1S/C27H32FN3O2/c1-27(2,3)26-25(21-8-4-5-9-23(21)29-26)20-7-6-14-31(17-20)16-19-12-10-18(15-22(19)28)11-13-24(32)30-33/h4-5,8-13,15,20,29,33H,6-7,14,16-17H2,1-3H3,(H,30,32)/b13-11+/t20-/m1/s1
NCI pathway
Reactome pathway
n/an/a 48n/an/an/an/an/an/a
Novartis Institutes for Biomedical Research
Curated by ChEMBL
Assay Description
Inhibition of HDAC2 expressed in baculovirus system by fluorescent assay
J Med Chem 53: 2952-63 (2010)
Article DOI: 10.1021/jm100007m
BindingDB Entry DOI: 10.7270/Q20V8CZC
Histone deacetylase 3
(Homo sapiens (Human))
BDBM50314643
((E)-3-{4-[(S)-3-(2-tert-Butyl-1H-indol-3-yl)piperi...)
Show SMILES CC(C)(C)c1[nH]c2ccccc2c1[C@@H]1CCCN(Cc2ccc(\C=C\C(=O)NO)cc2F)C1 |r|
Show InChI InChI=1S/C27H32FN3O2/c1-27(2,3)26-25(21-8-4-5-9-23(21)29-26)20-7-6-14-31(17-20)16-19-12-10-18(15-22(19)28)11-13-24(32)30-33/h4-5,8-13,15,20,29,33H,6-7,14,16-17H2,1-3H3,(H,30,32)/b13-11+/t20-/m1/s1
NCI pathway
Reactome pathway
n/an/a 21n/an/an/an/an/an/a
Novartis Institutes for Biomedical Research
Curated by ChEMBL
Assay Description
Inhibition of FLAG-tagged HDAC3 expressed in HEK293 cells by fluorescent assay
J Med Chem 53: 2952-63 (2010)
Article DOI: 10.1021/jm100007m
BindingDB Entry DOI: 10.7270/Q20V8CZC
Histone deacetylase 1
(Homo sapiens (Human))
BDBM50314643
((E)-3-{4-[(S)-3-(2-tert-Butyl-1H-indol-3-yl)piperi...)
Show SMILES CC(C)(C)c1[nH]c2ccccc2c1[C@@H]1CCCN(Cc2ccc(\C=C\C(=O)NO)cc2F)C1 |r|
Show InChI InChI=1S/C27H32FN3O2/c1-27(2,3)26-25(21-8-4-5-9-23(21)29-26)20-7-6-14-31(17-20)16-19-12-10-18(15-22(19)28)11-13-24(32)30-33/h4-5,8-13,15,20,29,33H,6-7,14,16-17H2,1-3H3,(H,30,32)/b13-11+/t20-/m1/s1
NCI pathway
Reactome pathway
n/an/a 15n/an/an/an/an/an/a
Novartis Institutes for Biomedical Research
Curated by ChEMBL
Assay Description
Inhibition of FLAG-tagged HDAC1 expressed in HEK293 cells by fluorescent assay
J Med Chem 53: 2952-63 (2010)
Article DOI: 10.1021/jm100007m
BindingDB Entry DOI: 10.7270/Q20V8CZC
Cereblon/Histone deacetylase 6
(Homo sapiens (Human))
BDBM50314643
((E)-3-{4-[(S)-3-(2-tert-Butyl-1H-indol-3-yl)piperi...)
Show SMILES CC(C)(C)c1[nH]c2ccccc2c1[C@@H]1CCCN(Cc2ccc(\C=C\C(=O)NO)cc2F)C1 |r|
Show InChI InChI=1S/C27H32FN3O2/c1-27(2,3)26-25(21-8-4-5-9-23(21)29-26)20-7-6-14-31(17-20)16-19-12-10-18(15-22(19)28)11-13-24(32)30-33/h4-5,8-13,15,20,29,33H,6-7,14,16-17H2,1-3H3,(H,30,32)/b13-11+/t20-/m1/s1
NCI pathway
Reactome pathway
n/an/a 110n/an/an/an/an/an/a
Novartis Institutes for Biomedical Research
Curated by ChEMBL
Assay Description
Inhibition of FLAG-tagged HDAC6 expressed in HEK293 cells by fluorescent assay
J Med Chem 53: 2952-63 (2010)
Article DOI: 10.1021/jm100007m
BindingDB Entry DOI: 10.7270/Q20V8CZC
Histone deacetylase 8
(Homo sapiens (Human))
BDBM50314643
((E)-3-{4-[(S)-3-(2-tert-Butyl-1H-indol-3-yl)piperi...)
Show SMILES CC(C)(C)c1[nH]c2ccccc2c1[C@@H]1CCCN(Cc2ccc(\C=C\C(=O)NO)cc2F)C1 |r|
Show InChI InChI=1S/C27H32FN3O2/c1-27(2,3)26-25(21-8-4-5-9-23(21)29-26)20-7-6-14-31(17-20)16-19-12-10-18(15-22(19)28)11-13-24(32)30-33/h4-5,8-13,15,20,29,33H,6-7,14,16-17H2,1-3H3,(H,30,32)/b13-11+/t20-/m1/s1
NCI pathway
Reactome pathway
n/an/a 364n/an/an/an/an/an/a
Novartis Institutes for Biomedical Research
Curated by ChEMBL
Assay Description
Inhibition of HDAC8 expressed in baculovirus system by fluorescent assay
J Med Chem 53: 2952-63 (2010)
Article DOI: 10.1021/jm100007m
BindingDB Entry DOI: 10.7270/Q20V8CZC
Histone deacetylase 4
(Homo sapiens (Human))
BDBM50314643
((E)-3-{4-[(S)-3-(2-tert-Butyl-1H-indol-3-yl)piperi...)
Show SMILES CC(C)(C)c1[nH]c2ccccc2c1[C@@H]1CCCN(Cc2ccc(\C=C\C(=O)NO)cc2F)C1 |r|
Show InChI InChI=1S/C27H32FN3O2/c1-27(2,3)26-25(21-8-4-5-9-23(21)29-26)20-7-6-14-31(17-20)16-19-12-10-18(15-22(19)28)11-13-24(32)30-33/h4-5,8-13,15,20,29,33H,6-7,14,16-17H2,1-3H3,(H,30,32)/b13-11+/t20-/m1/s1
n/an/a 38n/an/an/an/an/an/a
Novartis Institutes for Biomedical Research
Curated by ChEMBL
Assay Description
Inhibition of HDAC4 expressed in baculovirus system by fluorescent assay
J Med Chem 53: 2952-63 (2010)
Article DOI: 10.1021/jm100007m
BindingDB Entry DOI: 10.7270/Q20V8CZC